{"text_format":"1","workbook":"xlsx","n_sheets":3,"sheets":["Individual Results","Champ Carcases","Pen of 3 Results"],"not_rendered":{"charts":0,"images":3,"macros":0,"external_links":1,"defined_names":0,"comments":1,"pivot_tables":0},"unopened":[],"bounds":{"document_bytes":16777216,"sheet_cells":100000,"rows_first":2000,"rows_last":500,"rows_between":2000,"halvings":0,"cell_chars":16384,"cell_head_chars":4096},"cells_cut":0,"cells_raw":0,"read":"whole","date_system":"1900"}

{"sheet":"Individual Results","index":0,"n_rows":116,"n_cols":25,"rows_kept":116,"cut":false,"hidden":false,"merged":[[2,1,5,18]]}
[]
[]
[]
[]
[]
[]
[]
["Individual Placing","Body\nNo.","Tag \nNumber","Sex","Fat Dist","In or Out of Spec","Supplier","Breed","Dentition","HSCW","P8 Fat\nDepth","Rib Fat\nDepth","EMA","Meat\nColour","Fat\nColour","Marbling","pH","Index Score","Lean Meat Yield %","Yield\n$/kg","PBP\nCarcase\nValue          (Ex GST)","PBP\n$/kg         (Ex GST)"," +10 % GST","PBP \nCarcase\nValue (GST Inclusive)","PBP \n$/kg(GST Inclusive)"]
[1,{"$f":"IF('[1]Sort Sheet'!D5=0,\"\",'[1]Sort Sheet'!D5)","v":201},{"$f":"IF('[1]Sort Sheet'!E5=0,\"\",'[1]Sort Sheet'!E5)","v":"321B"},{"$f":"IF('[1]Sort Sheet'!F5=0,\"\",'[1]Sort Sheet'!F5)","v":"M"},{"$f":"IF('[1]Sort Sheet'!E5=0,\"\",'[1]Sort Sheet'!AT5)","v":"Y"},{"$f":"IF('[1]Sort Sheet'!E5=0,\"\",'[1]Sort Sheet'!H5)","v":"Y"},{"$f":"IF('[1]Sort Sheet'!E5=0,\"\",'[1]Sort Sheet'!J5)","v":"Darr Creek Pastoral"},{"$f":"IF('[1]Sort Sheet'!E5=0,\"\",'[1]Sort Sheet'!L5)","v":"Angus X Limousin"},{"$f":"IF('[1]Sort Sheet'!E5=0,\"\",'[1]Sort Sheet'!O5)","v":0},{"$f":"IF('[1]Sort Sheet'!P5=0,\"\",'[1]Sort Sheet'!P5)","v":272.8},{"$f":"IF('[1]Sort Sheet'!E5=0,\"\",'[1]Sort Sheet'!Q5)","v":6},{"$f":"IF('[1]Sort Sheet'!E5=0,\"\",'[1]Sort Sheet'!R5)","v":3},{"$f":"IF('[1]Sort Sheet'!E5=0,\"\",'[1]Sort Sheet'!S5)","v":94},{"$f":"IF('[1]Sort Sheet'!E5=0,\"\",'[1]Sort Sheet'!U5)","v":"1b"},{"$f":"IF('[1]Sort Sheet'!E5=0,\"\",'[1]Sort Sheet'!V5)","v":0},{"$f":"IF('[1]Sort Sheet'!E5=0,\"\",'[1]Sort Sheet'!W5)","v":0},{"$f":"IF('[1]Sort Sheet'!E5=0,\"\",'[1]Sort Sheet'!X5)","v":5.46},{"$f":"IF('[1]Sort Sheet'!E5=0,\"\",'[1]Sort Sheet'!M5)","v":54.37},{"$f":"IF('[1]Sort Sheet'!E5=0,\"\",'[1]Sort Sheet'!Z5)","v":63.35},{"$f":"IF('[1]Sort Sheet'!E5=0,\"\",'[1]Sort Sheet'!AA5)","v":10.756676557863502},{"$f":"IF('[1]Sort Sheet'!E5=0,\"\",'[1]Sort Sheet'!AB5)","v":1858.9559347181012},{"$f":"IF('[1]Sort Sheet'!E5=0,\"\",'[1]Sort Sheet'!AC5)","v":6.8143545994065287},{"$f":"IF(U9=\"\",\"\",ROUND(U9*0.1,2))","v":185.9},{"$f":"IF(W9=\"\",\"\",U9+W9)","v":2044.8559347181013},{"$f":"X9/J9","v":7.4958062123097546}]
[2,{"$f":"IF('[1]Sort Sheet'!D6=0,\"\",'[1]Sort Sheet'!D6)","v":289},{"$f":"IF('[1]Sort Sheet'!E6=0,\"\",'[1]Sort Sheet'!E6)","v":"349C"},{"$f":"IF('[1]Sort Sheet'!F6=0,\"\",'[1]Sort Sheet'!F6)","v":"M"},{"$f":"IF('[1]Sort Sheet'!E6=0,\"\",'[1]Sort Sheet'!AT6)","v":"Y"},{"$f":"IF('[1]Sort Sheet'!E6=0,\"\",'[1]Sort Sheet'!H6)","v":"Y"},{"$f":"IF('[1]Sort Sheet'!E6=0,\"\",'[1]Sort Sheet'!J6)","v":"B Feeders Pty ltd"},{"$f":"IF('[1]Sort Sheet'!E6=0,\"\",'[1]Sort Sheet'!L6)","v":"Charolais X Santa"},{"$f":"IF('[1]Sort Sheet'!E6=0,\"\",'[1]Sort Sheet'!O6)","v":0},{"$f":"IF('[1]Sort Sheet'!P6=0,\"\",'[1]Sort Sheet'!P6)","v":304.39999999999998},{"$f":"IF('[1]Sort Sheet'!E6=0,\"\",'[1]Sort Sheet'!Q6)","v":6},{"$f":"IF('[1]Sort Sheet'!E6=0,\"\",'[1]Sort Sheet'!R6)","v":3},{"$f":"IF('[1]Sort Sheet'!E6=0,\"\",'[1]Sort Sheet'!S6)","v":102},{"$f":"IF('[1]Sort Sheet'!E6=0,\"\",'[1]Sort Sheet'!U6)","v":"1b"},{"$f":"IF('[1]Sort Sheet'!E6=0,\"\",'[1]Sort Sheet'!V6)","v":1},{"$f":"IF('[1]Sort Sheet'!E6=0,\"\",'[1]Sort Sheet'!W6)","v":1},{"$f":"IF('[1]Sort Sheet'!E6=0,\"\",'[1]Sort Sheet'!X6)","v":5.49},{"$f":"IF('[1]Sort Sheet'!E6=0,\"\",'[1]Sort Sheet'!M6)","v":51.87},{"$f":"IF('[1]Sort Sheet'!E6=0,\"\",'[1]Sort Sheet'!Z6)","v":63.17},{"$f":"IF('[1]Sort Sheet'!E6=0,\"\",'[1]Sort Sheet'!AA6)","v":10.756676557863502},{"$f":"IF('[1]Sort Sheet'!E6=0,\"\",'[1]Sort Sheet'!AB6)","v":2068.3957418397626},{"$f":"IF('[1]Sort Sheet'!E6=0,\"\",'[1]Sort Sheet'!AC6)","v":6.7949925816023748},{"$f":"IF(U10=\"\",\"\",ROUND(U10*0.1,2))","v":206.84},{"$f":"IF(W10=\"\",\"\",U10+W10)","v":2275.2357418397628},{"$f":"X10/J10","v":7.4744932386325988}]
[3,{"$f":"IF('[1]Sort Sheet'!D7=0,\"\",'[1]Sort Sheet'!D7)","v":203},{"$f":"IF('[1]Sort Sheet'!E7=0,\"\",'[1]Sort Sheet'!E7)","v":"321C"},{"$f":"IF('[1]Sort Sheet'!F7=0,\"\",'[1]Sort Sheet'!F7)","v":"M"},{"$f":"IF('[1]Sort Sheet'!E7=0,\"\",'[1]Sort Sheet'!AT7)","v":"Y"},{"$f":"IF('[1]Sort Sheet'!E7=0,\"\",'[1]Sort Sheet'!H7)","v":"Y"},{"$f":"IF('[1]Sort Sheet'!E7=0,\"\",'[1]Sort Sheet'!J7)","v":"Darr Creek Pastoral"},{"$f":"IF('[1]Sort Sheet'!E7=0,\"\",'[1]Sort Sheet'!L7)","v":"Angus X Limousin"},{"$f":"IF('[1]Sort Sheet'!E7=0,\"\",'[1]Sort Sheet'!O7)","v":0},{"$f":"IF('[1]Sort Sheet'!P7=0,\"\",'[1]Sort Sheet'!P7)","v":269.8},{"$f":"IF('[1]Sort Sheet'!E7=0,\"\",'[1]Sort Sheet'!Q7)","v":10},{"$f":"IF('[1]Sort Sheet'!E7=0,\"\",'[1]Sort Sheet'!R7)","v":3},{"$f":"IF('[1]Sort Sheet'!E7=0,\"\",'[1]Sort Sheet'!S7)","v":90},{"$f":"IF('[1]Sort Sheet'!E7=0,\"\",'[1]Sort Sheet'!U7)","v":"2"},{"$f":"IF('[1]Sort Sheet'!E7=0,\"\",'[1]Sort Sheet'!V7)","v":1},{"$f":"IF('[1]Sort Sheet'!E7=0,\"\",'[1]Sort Sheet'!W7)","v":1},{"$f":"IF('[1]Sort Sheet'!E7=0,\"\",'[1]Sort Sheet'!X7)","v":5.64},{"$f":"IF('[1]Sort Sheet'!E7=0,\"\",'[1]Sort Sheet'!M7)","v":54.48},{"$f":"IF('[1]Sort Sheet'!E7=0,\"\",'[1]Sort Sheet'!Z7)","v":62.79},{"$f":"IF('[1]Sort Sheet'!E7=0,\"\",'[1]Sort Sheet'!AA7)","v":10.756676557863502},{"$f":"IF('[1]Sort Sheet'!E7=0,\"\",'[1]Sort Sheet'!AB7)","v":1822.2608234421368},{"$f":"IF('[1]Sort Sheet'!E7=0,\"\",'[1]Sort Sheet'!AC7)","v":6.7541172106824936},182.23,2004.4908234421368,7.4295434523429824]
[4,{"$f":"IF('[1]Sort Sheet'!D8=0,\"\",'[1]Sort Sheet'!D8)","v":212},{"$f":"IF('[1]Sort Sheet'!E8=0,\"\",'[1]Sort Sheet'!E8)","v":"322B"},{"$f":"IF('[1]Sort Sheet'!F8=0,\"\",'[1]Sort Sheet'!F8)","v":"M"},{"$f":"IF('[1]Sort Sheet'!E8=0,\"\",'[1]Sort Sheet'!AT8)","v":"Y"},{"$f":"IF('[1]Sort Sheet'!E8=0,\"\",'[1]Sort Sheet'!H8)","v":"Y"},{"$f":"IF('[1]Sort Sheet'!E8=0,\"\",'[1]Sort Sheet'!J8)","v":"Rich Enterprises P/L"},{"$f":"IF('[1]Sort Sheet'!E8=0,\"\",'[1]Sort Sheet'!L8)","v":"Angus / Charolais X"},{"$f":"IF('[1]Sort Sheet'!E8=0,\"\",'[1]Sort Sheet'!O8)","v":0},{"$f":"IF('[1]Sort Sheet'!P8=0,\"\",'[1]Sort Sheet'!P8)","v":275},{"$f":"IF('[1]Sort Sheet'!E8=0,\"\",'[1]Sort Sheet'!Q8)","v":8},{"$f":"IF('[1]Sort Sheet'!E8=0,\"\",'[1]Sort Sheet'!R8)","v":3},{"$f":"IF('[1]Sort Sheet'!E8=0,\"\",'[1]Sort Sheet'!S8)","v":91},{"$f":"IF('[1]Sort Sheet'!E8=0,\"\",'[1]Sort Sheet'!U8)","v":"1b"},{"$f":"IF('[1]Sort Sheet'!E8=0,\"\",'[1]Sort Sheet'!V8)","v":1},{"$f":"IF('[1]Sort Sheet'!E8=0,\"\",'[1]Sort Sheet'!W8)","v":1},{"$f":"IF('[1]Sort Sheet'!E8=0,\"\",'[1]Sort Sheet'!X8)","v":5.48},{"$f":"IF('[1]Sort Sheet'!E8=0,\"\",'[1]Sort Sheet'!M8)","v":55.52},{"$f":"IF('[1]Sort Sheet'!E8=0,\"\",'[1]Sort Sheet'!Z8)","v":62.73},{"$f":"IF('[1]Sort Sheet'!E8=0,\"\",'[1]Sort Sheet'!AA8)","v":10.756676557863502},{"$f":"IF('[1]Sort Sheet'!E8=0,\"\",'[1]Sort Sheet'!AB8)","v":1855.6073813056382},{"$f":"IF('[1]Sort Sheet'!E8=0,\"\",'[1]Sort Sheet'!AC8)","v":6.7476632047477754},185.56,2041.1673813056382,7.4224268411114114]
[5,{"$f":"IF('[1]Sort Sheet'!D9=0,\"\",'[1]Sort Sheet'!D9)","v":238},{"$f":"IF('[1]Sort Sheet'!E9=0,\"\",'[1]Sort Sheet'!E9)","v":"331C"},{"$f":"IF('[1]Sort Sheet'!F9=0,\"\",'[1]Sort Sheet'!F9)","v":"M"},{"$f":"IF('[1]Sort Sheet'!E9=0,\"\",'[1]Sort Sheet'!AT9)","v":"Y"},{"$f":"IF('[1]Sort Sheet'!E9=0,\"\",'[1]Sort Sheet'!H9)","v":"Y"},{"$f":"IF('[1]Sort Sheet'!E9=0,\"\",'[1]Sort Sheet'!J9)","v":"G E & E E Kroll"},{"$f":"IF('[1]Sort Sheet'!E9=0,\"\",'[1]Sort Sheet'!L9)","v":"Angus X"},{"$f":"IF('[1]Sort Sheet'!E9=0,\"\",'[1]Sort Sheet'!O9)","v":0},{"$f":"IF('[1]Sort Sheet'!P9=0,\"\",'[1]Sort Sheet'!P9)","v":252.8},{"$f":"IF('[1]Sort Sheet'!E9=0,\"\",'[1]Sort Sheet'!Q9)","v":6},{"$f":"IF('[1]Sort Sheet'!E9=0,\"\",'[1]Sort Sheet'!R9)","v":3},{"$f":"IF('[1]Sort Sheet'!E9=0,\"\",'[1]Sort Sheet'!S9)","v":84},{"$f":"IF('[1]Sort Sheet'!E9=0,\"\",'[1]Sort Sheet'!U9)","v":"3"},{"$f":"IF('[1]Sort Sheet'!E9=0,\"\",'[1]Sort Sheet'!V9)","v":1},{"$f":"IF('[1]Sort Sheet'!E9=0,\"\",'[1]Sort Sheet'!W9)","v":1},{"$f":"IF('[1]Sort Sheet'!E9=0,\"\",'[1]Sort Sheet'!X9)","v":5.66},{"$f":"IF('[1]Sort Sheet'!E9=0,\"\",'[1]Sort Sheet'!M9)","v":54.54},{"$f":"IF('[1]Sort Sheet'!E9=0,\"\",'[1]Sort Sheet'!Z9)","v":62.62},{"$f":"IF('[1]Sort Sheet'!E9=0,\"\",'[1]Sort Sheet'!AA9)","v":10.756676557863502},{"$f":"IF('[1]Sort Sheet'!E9=0,\"\",'[1]Sort Sheet'!AB9)","v":1702.8180415430265},{"$f":"IF('[1]Sort Sheet'!E9=0,\"\",'[1]Sort Sheet'!AC9)","v":6.7358308605341239},170.28,1873.0980415430265,7.4094068099012125]
[6,{"$f":"IF('[1]Sort Sheet'!D10=0,\"\",'[1]Sort Sheet'!D10)","v":231},{"$f":"IF('[1]Sort Sheet'!E10=0,\"\",'[1]Sort Sheet'!E10)","v":"328C"},{"$f":"IF('[1]Sort Sheet'!F10=0,\"\",'[1]Sort Sheet'!F10)","v":"M"},{"$f":"IF('[1]Sort Sheet'!E10=0,\"\",'[1]Sort Sheet'!AT10)","v":"Y"},{"$f":"IF('[1]Sort Sheet'!E10=0,\"\",'[1]Sort Sheet'!H10)","v":"Y"},{"$f":"IF('[1]Sort Sheet'!E10=0,\"\",'[1]Sort Sheet'!J10)","v":"Juandah Grazing"},{"$f":"IF('[1]Sort Sheet'!E10=0,\"\",'[1]Sort Sheet'!L10)","v":"Charolais X Droughtmaster"},{"$f":"IF('[1]Sort Sheet'!E10=0,\"\",'[1]Sort Sheet'!O10)","v":0},{"$f":"IF('[1]Sort Sheet'!P10=0,\"\",'[1]Sort Sheet'!P10)","v":313.2},{"$f":"IF('[1]Sort Sheet'!E10=0,\"\",'[1]Sort Sheet'!Q10)","v":15},{"$f":"IF('[1]Sort Sheet'!E10=0,\"\",'[1]Sort Sheet'!R10)","v":4},{"$f":"IF('[1]Sort Sheet'!E10=0,\"\",'[1]Sort Sheet'!S10)","v":101},{"$f":"IF('[1]Sort Sheet'!E10=0,\"\",'[1]Sort Sheet'!U10)","v":"2"},{"$f":"IF('[1]Sort Sheet'!E10=0,\"\",'[1]Sort Sheet'!V10)","v":1},{"$f":"IF('[1]Sort Sheet'!E10=0,\"\",'[1]Sort Sheet'!W10)","v":0},{"$f":"IF('[1]Sort Sheet'!E10=0,\"\",'[1]Sort Sheet'!X10)","v":5.58},{"$f":"IF('[1]Sort Sheet'!E10=0,\"\",'[1]Sort Sheet'!M10)","v":52.65},{"$f":"IF('[1]Sort Sheet'!E10=0,\"\",'[1]Sort Sheet'!Z10)","v":62.24},{"$f":"IF('[1]Sort Sheet'!E10=0,\"\",'[1]Sort Sheet'!AA10)","v":10.756676557863502},{"$f":"IF('[1]Sort Sheet'!E10=0,\"\",'[1]Sort Sheet'!AB10)","v":2096.860059347181},{"$f":"IF('[1]Sort Sheet'!E10=0,\"\",'[1]Sort Sheet'!AC10)","v":6.6949554896142436},209.69,2306.5500593471811,7.3644637910190971]
[7,{"$f":"IF('[1]Sort Sheet'!D11=0,\"\",'[1]Sort Sheet'!D11)","v":202},{"$f":"IF('[1]Sort Sheet'!E11=0,\"\",'[1]Sort Sheet'!E11)","v":"319B"},{"$f":"IF('[1]Sort Sheet'!F11=0,\"\",'[1]Sort Sheet'!F11)","v":"M"},{"$f":"IF('[1]Sort Sheet'!E11=0,\"\",'[1]Sort Sheet'!AT11)","v":"Y"},{"$f":"IF('[1]Sort Sheet'!E11=0,\"\",'[1]Sort Sheet'!H11)","v":"Y"},{"$f":"IF('[1]Sort Sheet'!E11=0,\"\",'[1]Sort Sheet'!J11)","v":"Darr Creek Pastoral"},{"$f":"IF('[1]Sort Sheet'!E11=0,\"\",'[1]Sort Sheet'!L11)","v":"Angus X Limousin"},{"$f":"IF('[1]Sort Sheet'!E11=0,\"\",'[1]Sort Sheet'!O11)","v":0},{"$f":"IF('[1]Sort Sheet'!P11=0,\"\",'[1]Sort Sheet'!P11)","v":277.8},{"$f":"IF('[1]Sort Sheet'!E11=0,\"\",'[1]Sort Sheet'!Q11)","v":10},{"$f":"IF('[1]Sort Sheet'!E11=0,\"\",'[1]Sort Sheet'!R11)","v":3},{"$f":"IF('[1]Sort Sheet'!E11=0,\"\",'[1]Sort Sheet'!S11)","v":88},{"$f":"IF('[1]Sort Sheet'!E11=0,\"\",'[1]Sort Sheet'!U11)","v":"2"},{"$f":"IF('[1]Sort Sheet'!E11=0,\"\",'[1]Sort Sheet'!V11)","v":1},{"$f":"IF('[1]Sort Sheet'!E11=0,\"\",'[1]Sort Sheet'!W11)","v":1},{"$f":"IF('[1]Sort Sheet'!E11=0,\"\",'[1]Sort Sheet'!X11)","v":5.56},{"$f":"IF('[1]Sort Sheet'!E11=0,\"\",'[1]Sort Sheet'!M11)","v":55.05},{"$f":"IF('[1]Sort Sheet'!E11=0,\"\",'[1]Sort Sheet'!Z11)","v":62.2},{"$f":"IF('[1]Sort Sheet'!E11=0,\"\",'[1]Sort Sheet'!AA11)","v":10.756676557863502},{"$f":"IF('[1]Sort Sheet'!E11=0,\"\",'[1]Sort Sheet'!AB11)","v":1858.663353115727},{"$f":"IF('[1]Sort Sheet'!E11=0,\"\",'[1]Sort Sheet'!AC11)","v":6.6906528189910972},185.87,2044.5333531157271,7.3597312927132004]
[8,{"$f":"IF('[1]Sort Sheet'!D12=0,\"\",'[1]Sort Sheet'!D12)","v":237},{"$f":"IF('[1]Sort Sheet'!E12=0,\"\",'[1]Sort Sheet'!E12)","v":"331A"},{"$f":"IF('[1]Sort Sheet'!F12=0,\"\",'[1]Sort Sheet'!F12)","v":"M"},{"$f":"IF('[1]Sort Sheet'!E12=0,\"\",'[1]Sort Sheet'!AT12)","v":"Y"},{"$f":"IF('[1]Sort Sheet'!E12=0,\"\",'[1]Sort Sheet'!H12)","v":"Y"},{"$f":"IF('[1]Sort Sheet'!E12=0,\"\",'[1]Sort Sheet'!J12)","v":"G E & E E Kroll"},{"$f":"IF('[1]Sort Sheet'!E12=0,\"\",'[1]Sort Sheet'!L12)","v":"Angus X"},{"$f":"IF('[1]Sort Sheet'!E12=0,\"\",'[1]Sort Sheet'!O12)","v":0},{"$f":"IF('[1]Sort Sheet'!P12=0,\"\",'[1]Sort Sheet'!P12)","v":268.8},{"$f":"IF('[1]Sort Sheet'!E12=0,\"\",'[1]Sort Sheet'!Q12)","v":8},{"$f":"IF('[1]Sort Sheet'!E12=0,\"\",'[1]Sort Sheet'!R12)","v":4},{"$f":"IF('[1]Sort Sheet'!E12=0,\"\",'[1]Sort Sheet'!S12)","v":89},{"$f":"IF('[1]Sort Sheet'!E12=0,\"\",'[1]Sort Sheet'!U12)","v":"2"},{"$f":"IF('[1]Sort Sheet'!E12=0,\"\",'[1]Sort Sheet'!V12)","v":1},{"$f":"IF('[1]Sort Sheet'!E12=0,\"\",'[1]Sort Sheet'!W12)","v":0},{"$f":"IF('[1]Sort Sheet'!E12=0,\"\",'[1]Sort Sheet'!X12)","v":5.55},{"$f":"IF('[1]Sort Sheet'!E12=0,\"\",'[1]Sort Sheet'!M12)","v":51.74},{"$f":"IF('[1]Sort Sheet'!E12=0,\"\",'[1]Sort Sheet'!Z12)","v":62.15},{"$f":"IF('[1]Sort Sheet'!E12=0,\"\",'[1]Sort Sheet'!AA12)","v":10.756676557863502},{"$f":"IF('[1]Sort Sheet'!E12=0,\"\",'[1]Sort Sheet'!AB12)","v":1797.0017804154306},{"$f":"IF('[1]Sort Sheet'!E12=0,\"\",'[1]Sort Sheet'!AC12)","v":6.6852744807121676},179.7,1976.7017804154307,7.3538012664264532]
[9,{"$f":"IF('[1]Sort Sheet'!D13=0,\"\",'[1]Sort Sheet'!D13)","v":267},{"$f":"IF('[1]Sort Sheet'!E13=0,\"\",'[1]Sort Sheet'!E13)","v":"340A"},{"$f":"IF('[1]Sort Sheet'!F13=0,\"\",'[1]Sort Sheet'!F13)","v":"M"},{"$f":"IF('[1]Sort Sheet'!E13=0,\"\",'[1]Sort Sheet'!AT13)","v":"Y"},{"$f":"IF('[1]Sort Sheet'!E13=0,\"\",'[1]Sort Sheet'!H13)","v":"Y"},{"$f":"IF('[1]Sort Sheet'!E13=0,\"\",'[1]Sort Sheet'!J13)","v":"Smithfield Cattle Co"},{"$f":"IF('[1]Sort Sheet'!E13=0,\"\",'[1]Sort Sheet'!L13)","v":"Angus"},{"$f":"IF('[1]Sort Sheet'!E13=0,\"\",'[1]Sort Sheet'!O13)","v":0},{"$f":"IF('[1]Sort Sheet'!P13=0,\"\",'[1]Sort Sheet'!P13)","v":272},{"$f":"IF('[1]Sort Sheet'!E13=0,\"\",'[1]Sort Sheet'!Q13)","v":10},{"$f":"IF('[1]Sort Sheet'!E13=0,\"\",'[1]Sort Sheet'!R13)","v":3},{"$f":"IF('[1]Sort Sheet'!E13=0,\"\",'[1]Sort Sheet'!S13)","v":84},{"$f":"IF('[1]Sort Sheet'!E13=0,\"\",'[1]Sort Sheet'!U13)","v":"1b"},{"$f":"IF('[1]Sort Sheet'!E13=0,\"\",'[1]Sort Sheet'!V13)","v":1},{"$f":"IF('[1]Sort Sheet'!E13=0,\"\",'[1]Sort Sheet'!W13)","v":1},{"$f":"IF('[1]Sort Sheet'!E13=0,\"\",'[1]Sort Sheet'!X13)","v":5.51},{"$f":"IF('[1]Sort Sheet'!E13=0,\"\",'[1]Sort Sheet'!M13)","v":54.66},{"$f":"IF('[1]Sort Sheet'!E13=0,\"\",'[1]Sort Sheet'!Z13)","v":61.75},{"$f":"IF('[1]Sort Sheet'!E13=0,\"\",'[1]Sort Sheet'!AA13)","v":10.756676557863502},{"$f":"IF('[1]Sort Sheet'!E13=0,\"\",'[1]Sort Sheet'!AB13)","v":1806.6913946587538},{"$f":"IF('[1]Sort Sheet'!E13=0,\"\",'[1]Sort Sheet'!AC13)","v":6.6422477744807127},180.67,1987.3613946587539,7.3064757156571831]
[10,{"$f":"IF('[1]Sort Sheet'!D14=0,\"\",'[1]Sort Sheet'!D14)","v":204},{"$f":"IF('[1]Sort Sheet'!E14=0,\"\",'[1]Sort Sheet'!E14)","v":"320C"},{"$f":"IF('[1]Sort Sheet'!F14=0,\"\",'[1]Sort Sheet'!F14)","v":"M"},{"$f":"IF('[1]Sort Sheet'!E14=0,\"\",'[1]Sort Sheet'!AT14)","v":"Y"},{"$f":"IF('[1]Sort Sheet'!E14=0,\"\",'[1]Sort Sheet'!H14)","v":"Y"},{"$f":"IF('[1]Sort Sheet'!E14=0,\"\",'[1]Sort Sheet'!J14)","v":"Darr Creek Pastoral"},{"$f":"IF('[1]Sort Sheet'!E14=0,\"\",'[1]Sort Sheet'!L14)","v":"Angus/Hereford X Limousin"},{"$f":"IF('[1]Sort Sheet'!E14=0,\"\",'[1]Sort Sheet'!O14)","v":0},{"$f":"IF('[1]Sort Sheet'!P14=0,\"\",'[1]Sort Sheet'!P14)","v":277.39999999999998},{"$f":"IF('[1]Sort Sheet'!E14=0,\"\",'[1]Sort Sheet'!Q14)","v":8},{"$f":"IF('[1]Sort Sheet'!E14=0,\"\",'[1]Sort Sheet'!R14)","v":3},{"$f":"IF('[1]Sort Sheet'!E14=0,\"\",'[1]Sort Sheet'!S14)","v":84},{"$f":"IF('[1]Sort Sheet'!E14=0,\"\",'[1]Sort Sheet'!U14)","v":"1b"},{"$f":"IF('[1]Sort Sheet'!E14=0,\"\",'[1]Sort Sheet'!V14)","v":0},{"$f":"IF('[1]Sort Sheet'!E14=0,\"\",'[1]Sort Sheet'!W14)","v":1},{"$f":"IF('[1]Sort Sheet'!E14=0,\"\",'[1]Sort Sheet'!X14)","v":5.59},{"$f":"IF('[1]Sort Sheet'!E14=0,\"\",'[1]Sort Sheet'!M14)","v":56.6},{"$f":"IF('[1]Sort Sheet'!E14=0,\"\",'[1]Sort Sheet'!Z14)","v":61.56},{"$f":"IF('[1]Sort Sheet'!E14=0,\"\",'[1]Sort Sheet'!AA14)","v":10.756676557863502},{"$f":"IF('[1]Sort Sheet'!E14=0,\"\",'[1]Sort Sheet'!AB14)","v":1836.8901186943619},{"$f":"IF('[1]Sort Sheet'!E14=0,\"\",'[1]Sort Sheet'!AC14)","v":6.6218100890207721},183.69,2020.580118694362,7.2839946600373544]
[11,{"$f":"IF('[1]Sort Sheet'!D15=0,\"\",'[1]Sort Sheet'!D15)","v":214},{"$f":"IF('[1]Sort Sheet'!E15=0,\"\",'[1]Sort Sheet'!E15)","v":"327C"},{"$f":"IF('[1]Sort Sheet'!F15=0,\"\",'[1]Sort Sheet'!F15)","v":"M"},{"$f":"IF('[1]Sort Sheet'!E15=0,\"\",'[1]Sort Sheet'!AT15)","v":"Y"},{"$f":"IF('[1]Sort Sheet'!E15=0,\"\",'[1]Sort Sheet'!H15)","v":"Y"},{"$f":"IF('[1]Sort Sheet'!E15=0,\"\",'[1]Sort Sheet'!J15)","v":"D J & K L Hart"},{"$f":"IF('[1]Sort Sheet'!E15=0,\"\",'[1]Sort Sheet'!L15)","v":"Angus / Charolais X"},{"$f":"IF('[1]Sort Sheet'!E15=0,\"\",'[1]Sort Sheet'!O15)","v":0},{"$f":"IF('[1]Sort Sheet'!P15=0,\"\",'[1]Sort Sheet'!P15)","v":287.60000000000002},{"$f":"IF('[1]Sort Sheet'!E15=0,\"\",'[1]Sort Sheet'!Q15)","v":11},{"$f":"IF('[1]Sort Sheet'!E15=0,\"\",'[1]Sort Sheet'!R15)","v":3},{"$f":"IF('[1]Sort Sheet'!E15=0,\"\",'[1]Sort Sheet'!S15)","v":87},{"$f":"IF('[1]Sort Sheet'!E15=0,\"\",'[1]Sort Sheet'!U15)","v":"1b"},{"$f":"IF('[1]Sort Sheet'!E15=0,\"\",'[1]Sort Sheet'!V15)","v":1},{"$f":"IF('[1]Sort Sheet'!E15=0,\"\",'[1]Sort Sheet'!W15)","v":2},{"$f":"IF('[1]Sort Sheet'!E15=0,\"\",'[1]Sort Sheet'!X15)","v":5.49},{"$f":"IF('[1]Sort Sheet'!E15=0,\"\",'[1]Sort Sheet'!M15)","v":56.88},{"$f":"IF('[1]Sort Sheet'!E15=0,\"\",'[1]Sort Sheet'!Z15)","v":61.52},{"$f":"IF('[1]Sort Sheet'!E15=0,\"\",'[1]Sort Sheet'!AA15)","v":10.756676557863502},{"$f":"IF('[1]Sort Sheet'!E15=0,\"\",'[1]Sort Sheet'!AB15)","v":1903.1951335311576},{"$f":"IF('[1]Sort Sheet'!E15=0,\"\",'[1]Sort Sheet'!AC15)","v":6.6175074183976266},190.32,2093.5151335311575,7.2792598523336487]
[12,{"$f":"IF('[1]Sort Sheet'!D16=0,\"\",'[1]Sort Sheet'!D16)","v":206},{"$f":"IF('[1]Sort Sheet'!E16=0,\"\",'[1]Sort Sheet'!E16)","v":"321A"},{"$f":"IF('[1]Sort Sheet'!F16=0,\"\",'[1]Sort Sheet'!F16)","v":"M"},{"$f":"IF('[1]Sort Sheet'!E16=0,\"\",'[1]Sort Sheet'!AT16)","v":"Y"},{"$f":"IF('[1]Sort Sheet'!E16=0,\"\",'[1]Sort Sheet'!H16)","v":"Y"},{"$f":"IF('[1]Sort Sheet'!E16=0,\"\",'[1]Sort Sheet'!J16)","v":"Darr Creek Pastoral"},{"$f":"IF('[1]Sort Sheet'!E16=0,\"\",'[1]Sort Sheet'!L16)","v":"Angus X Limousin"},{"$f":"IF('[1]Sort Sheet'!E16=0,\"\",'[1]Sort Sheet'!O16)","v":0},{"$f":"IF('[1]Sort Sheet'!P16=0,\"\",'[1]Sort Sheet'!P16)","v":292.39999999999998},{"$f":"IF('[1]Sort Sheet'!E16=0,\"\",'[1]Sort Sheet'!Q16)","v":10},{"$f":"IF('[1]Sort Sheet'!E16=0,\"\",'[1]Sort Sheet'!R16)","v":4},{"$f":"IF('[1]Sort Sheet'!E16=0,\"\",'[1]Sort Sheet'!S16)","v":91},{"$f":"IF('[1]Sort Sheet'!E16=0,\"\",'[1]Sort Sheet'!U16)","v":"2"},{"$f":"IF('[1]Sort Sheet'!E16=0,\"\",'[1]Sort Sheet'!V16)","v":1},{"$f":"IF('[1]Sort Sheet'!E16=0,\"\",'[1]Sort Sheet'!W16)","v":1},{"$f":"IF('[1]Sort Sheet'!E16=0,\"\",'[1]Sort Sheet'!X16)","v":5.58},{"$f":"IF('[1]Sort Sheet'!E16=0,\"\",'[1]Sort Sheet'!M16)","v":56.22},{"$f":"IF('[1]Sort Sheet'!E16=0,\"\",'[1]Sort Sheet'!Z16)","v":61.5},{"$f":"IF('[1]Sort Sheet'!E16=0,\"\",'[1]Sort Sheet'!AA16)","v":10.756676557863502},{"$f":"IF('[1]Sort Sheet'!E16=0,\"\",'[1]Sort Sheet'!AB16)","v":1934.3301186943618},{"$f":"IF('[1]Sort Sheet'!E16=0,\"\",'[1]Sort Sheet'!AC16)","v":6.6153560830860529},193.43,2127.7601186943616,7.2768813908835899]
[13,{"$f":"IF('[1]Sort Sheet'!D17=0,\"\",'[1]Sort Sheet'!D17)","v":227},{"$f":"IF('[1]Sort Sheet'!E17=0,\"\",'[1]Sort Sheet'!E17)","v":"328B"},{"$f":"IF('[1]Sort Sheet'!F17=0,\"\",'[1]Sort Sheet'!F17)","v":"F"},{"$f":"IF('[1]Sort Sheet'!E17=0,\"\",'[1]Sort Sheet'!AT17)","v":"Y"},{"$f":"IF('[1]Sort Sheet'!E17=0,\"\",'[1]Sort Sheet'!H17)","v":"Y"},{"$f":"IF('[1]Sort Sheet'!E17=0,\"\",'[1]Sort Sheet'!J17)","v":"Juandah Grazing"},{"$f":"IF('[1]Sort Sheet'!E17=0,\"\",'[1]Sort Sheet'!L17)","v":"Charolais X Droughtmaster"},{"$f":"IF('[1]Sort Sheet'!E17=0,\"\",'[1]Sort Sheet'!O17)","v":0},{"$f":"IF('[1]Sort Sheet'!P17=0,\"\",'[1]Sort Sheet'!P17)","v":287.60000000000002},{"$f":"IF('[1]Sort Sheet'!E17=0,\"\",'[1]Sort Sheet'!Q17)","v":10},{"$f":"IF('[1]Sort Sheet'!E17=0,\"\",'[1]Sort Sheet'!R17)","v":4},{"$f":"IF('[1]Sort Sheet'!E17=0,\"\",'[1]Sort Sheet'!S17)","v":106},{"$f":"IF('[1]Sort Sheet'!E17=0,\"\",'[1]Sort Sheet'!U17)","v":"1b"},{"$f":"IF('[1]Sort Sheet'!E17=0,\"\",'[1]Sort Sheet'!V17)","v":1},{"$f":"IF('[1]Sort Sheet'!E17=0,\"\",'[1]Sort Sheet'!W17)","v":1},{"$f":"IF('[1]Sort Sheet'!E17=0,\"\",'[1]Sort Sheet'!X17)","v":5.48},{"$f":"IF('[1]Sort Sheet'!E17=0,\"\",'[1]Sort Sheet'!M17)","v":54.87},{"$f":"IF('[1]Sort Sheet'!E17=0,\"\",'[1]Sort Sheet'!Z17)","v":61.49},{"$f":"IF('[1]Sort Sheet'!E17=0,\"\",'[1]Sort Sheet'!AA17)","v":10.756676557863502},{"$f":"IF('[1]Sort Sheet'!E17=0,\"\",'[1]Sort Sheet'!AB17)","v":1902.2670474777449},{"$f":"IF('[1]Sort Sheet'!E17=0,\"\",'[1]Sort Sheet'!AC17)","v":6.614280415430267},190.23,2092.4970474777447,7.2757199147348555]
[14,{"$f":"IF('[1]Sort Sheet'!D18=0,\"\",'[1]Sort Sheet'!D18)","v":230},{"$f":"IF('[1]Sort Sheet'!E18=0,\"\",'[1]Sort Sheet'!E18)","v":"330A"},{"$f":"IF('[1]Sort Sheet'!F18=0,\"\",'[1]Sort Sheet'!F18)","v":"M"},{"$f":"IF('[1]Sort Sheet'!E18=0,\"\",'[1]Sort Sheet'!AT18)","v":"Y"},{"$f":"IF('[1]Sort Sheet'!E18=0,\"\",'[1]Sort Sheet'!H18)","v":"Y"},{"$f":"IF('[1]Sort Sheet'!E18=0,\"\",'[1]Sort Sheet'!J18)","v":"Juandah Grazing"},{"$f":"IF('[1]Sort Sheet'!E18=0,\"\",'[1]Sort Sheet'!L18)","v":"Charolais X Droughtmaster"},{"$f":"IF('[1]Sort Sheet'!E18=0,\"\",'[1]Sort Sheet'!O18)","v":0},{"$f":"IF('[1]Sort Sheet'!P18=0,\"\",'[1]Sort Sheet'!P18)","v":272.8},{"$f":"IF('[1]Sort Sheet'!E18=0,\"\",'[1]Sort Sheet'!Q18)","v":8},{"$f":"IF('[1]Sort Sheet'!E18=0,\"\",'[1]Sort Sheet'!R18)","v":5},{"$f":"IF('[1]Sort Sheet'!E18=0,\"\",'[1]Sort Sheet'!S18)","v":87},{"$f":"IF('[1]Sort Sheet'!E18=0,\"\",'[1]Sort Sheet'!U18)","v":"1b"},{"$f":"IF('[1]Sort Sheet'!E18=0,\"\",'[1]Sort Sheet'!V18)","v":1},{"$f":"IF('[1]Sort Sheet'!E18=0,\"\",'[1]Sort Sheet'!W18)","v":1},{"$f":"IF('[1]Sort Sheet'!E18=0,\"\",'[1]Sort Sheet'!X18)","v":5.5},{"$f":"IF('[1]Sort Sheet'!E18=0,\"\",'[1]Sort Sheet'!M18)","v":56.67},{"$f":"IF('[1]Sort Sheet'!E18=0,\"\",'[1]Sort Sheet'!Z18)","v":61.27},{"$f":"IF('[1]Sort Sheet'!E18=0,\"\",'[1]Sort Sheet'!AA18)","v":10.756676557863502},{"$f":"IF('[1]Sort Sheet'!E18=0,\"\",'[1]Sort Sheet'!AB18)","v":1797.9199703264096},{"$f":"IF('[1]Sort Sheet'!E18=0,\"\",'[1]Sort Sheet'!AC18)","v":6.5906157270029677},179.79,1977.7099703264096,7.2496699792023804]
[15,{"$f":"IF('[1]Sort Sheet'!D19=0,\"\",'[1]Sort Sheet'!D19)","v":259},{"$f":"IF('[1]Sort Sheet'!E19=0,\"\",'[1]Sort Sheet'!E19)","v":"338C"},{"$f":"IF('[1]Sort Sheet'!F19=0,\"\",'[1]Sort Sheet'!F19)","v":"F"},{"$f":"IF('[1]Sort Sheet'!E19=0,\"\",'[1]Sort Sheet'!AT19)","v":"Y"},{"$f":"IF('[1]Sort Sheet'!E19=0,\"\",'[1]Sort Sheet'!H19)","v":"Y"},{"$f":"IF('[1]Sort Sheet'!E19=0,\"\",'[1]Sort Sheet'!J19)","v":"RB & VA Budd & Willoise Grazing Co Pty Ltd"},{"$f":"IF('[1]Sort Sheet'!E19=0,\"\",'[1]Sort Sheet'!L19)","v":"Charolais X"},{"$f":"IF('[1]Sort Sheet'!E19=0,\"\",'[1]Sort Sheet'!O19)","v":0},{"$f":"IF('[1]Sort Sheet'!P19=0,\"\",'[1]Sort Sheet'!P19)","v":236},{"$f":"IF('[1]Sort Sheet'!E19=0,\"\",'[1]Sort Sheet'!Q19)","v":6},{"$f":"IF('[1]Sort Sheet'!E19=0,\"\",'[1]Sort Sheet'!R19)","v":3},{"$f":"IF('[1]Sort Sheet'!E19=0,\"\",'[1]Sort Sheet'!S19)","v":86},{"$f":"IF('[1]Sort Sheet'!E19=0,\"\",'[1]Sort Sheet'!U19)","v":"1b"},{"$f":"IF('[1]Sort Sheet'!E19=0,\"\",'[1]Sort Sheet'!V19)","v":1},{"$f":"IF('[1]Sort Sheet'!E19=0,\"\",'[1]Sort Sheet'!W19)","v":1},{"$f":"IF('[1]Sort Sheet'!E19=0,\"\",'[1]Sort Sheet'!X19)","v":5.46},{"$f":"IF('[1]Sort Sheet'!E19=0,\"\",'[1]Sort Sheet'!M19)","v":54.3},{"$f":"IF('[1]Sort Sheet'!E19=0,\"\",'[1]Sort Sheet'!Z19)","v":61.14},{"$f":"IF('[1]Sort Sheet'!E19=0,\"\",'[1]Sort Sheet'!AA19)","v":10.756676557863502},{"$f":"IF('[1]Sort Sheet'!E19=0,\"\",'[1]Sort Sheet'!AB19)","v":1552.0851632047479},{"$f":"IF('[1]Sort Sheet'!E19=0,\"\",'[1]Sort Sheet'!AC19)","v":6.5766320474777453},155.21,1707.295163204748,7.2343015390031695]
[16,{"$f":"IF('[1]Sort Sheet'!D20=0,\"\",'[1]Sort Sheet'!D20)","v":236},{"$f":"IF('[1]Sort Sheet'!E20=0,\"\",'[1]Sort Sheet'!E20)","v":"332A"},{"$f":"IF('[1]Sort Sheet'!F20=0,\"\",'[1]Sort Sheet'!F20)","v":"M"},{"$f":"IF('[1]Sort Sheet'!E20=0,\"\",'[1]Sort Sheet'!AT20)","v":"Y"},{"$f":"IF('[1]Sort Sheet'!E20=0,\"\",'[1]Sort Sheet'!H20)","v":"Y"},{"$f":"IF('[1]Sort Sheet'!E20=0,\"\",'[1]Sort Sheet'!J20)","v":"G E & E E Kroll"},{"$f":"IF('[1]Sort Sheet'!E20=0,\"\",'[1]Sort Sheet'!L20)","v":"Angus X"},{"$f":"IF('[1]Sort Sheet'!E20=0,\"\",'[1]Sort Sheet'!O20)","v":0},{"$f":"IF('[1]Sort Sheet'!P20=0,\"\",'[1]Sort Sheet'!P20)","v":255},{"$f":"IF('[1]Sort Sheet'!E20=0,\"\",'[1]Sort Sheet'!Q20)","v":6},{"$f":"IF('[1]Sort Sheet'!E20=0,\"\",'[1]Sort Sheet'!R20)","v":5},{"$f":"IF('[1]Sort Sheet'!E20=0,\"\",'[1]Sort Sheet'!S20)","v":81},{"$f":"IF('[1]Sort Sheet'!E20=0,\"\",'[1]Sort Sheet'!U20)","v":"2"},{"$f":"IF('[1]Sort Sheet'!E20=0,\"\",'[1]Sort Sheet'!V20)","v":2},{"$f":"IF('[1]Sort Sheet'!E20=0,\"\",'[1]Sort Sheet'!W20)","v":1},{"$f":"IF('[1]Sort Sheet'!E20=0,\"\",'[1]Sort Sheet'!X20)","v":5.53},{"$f":"IF('[1]Sort Sheet'!E20=0,\"\",'[1]Sort Sheet'!M20)","v":54.39},{"$f":"IF('[1]Sort Sheet'!E20=0,\"\",'[1]Sort Sheet'!Z20)","v":61.08},{"$f":"IF('[1]Sort Sheet'!E20=0,\"\",'[1]Sort Sheet'!AA20)","v":10.756676557863502},{"$f":"IF('[1]Sort Sheet'!E20=0,\"\",'[1]Sort Sheet'!AB20)","v":1675.3954005934718},{"$f":"IF('[1]Sort Sheet'!E20=0,\"\",'[1]Sort Sheet'!AC20)","v":6.5701780415430262},167.54,1842.9354005934717,7.2271976493861638]
[17,{"$f":"IF('[1]Sort Sheet'!D21=0,\"\",'[1]Sort Sheet'!D21)","v":190},{"$f":"IF('[1]Sort Sheet'!E21=0,\"\",'[1]Sort Sheet'!E21)","v":"316B"},{"$f":"IF('[1]Sort Sheet'!F21=0,\"\",'[1]Sort Sheet'!F21)","v":"M"},{"$f":"IF('[1]Sort Sheet'!E21=0,\"\",'[1]Sort Sheet'!AT21)","v":"Y"},{"$f":"IF('[1]Sort Sheet'!E21=0,\"\",'[1]Sort Sheet'!H21)","v":"Y"},{"$f":"IF('[1]Sort Sheet'!E21=0,\"\",'[1]Sort Sheet'!J21)","v":"Riverglen Pastoral Company"},{"$f":"IF('[1]Sort Sheet'!E21=0,\"\",'[1]Sort Sheet'!L21)","v":"Charolais X"},{"$f":"IF('[1]Sort Sheet'!E21=0,\"\",'[1]Sort Sheet'!O21)","v":0},{"$f":"IF('[1]Sort Sheet'!P21=0,\"\",'[1]Sort Sheet'!P21)","v":264.2},{"$f":"IF('[1]Sort Sheet'!E21=0,\"\",'[1]Sort Sheet'!Q21)","v":11},{"$f":"IF('[1]Sort Sheet'!E21=0,\"\",'[1]Sort Sheet'!R21)","v":5},{"$f":"IF('[1]Sort Sheet'!E21=0,\"\",'[1]Sort Sheet'!S21)","v":83},{"$f":"IF('[1]Sort Sheet'!E21=0,\"\",'[1]Sort Sheet'!U21)","v":"2"},{"$f":"IF('[1]Sort Sheet'!E21=0,\"\",'[1]Sort Sheet'!V21)","v":0},{"$f":"IF('[1]Sort Sheet'!E21=0,\"\",'[1]Sort Sheet'!W21)","v":1},{"$f":"IF('[1]Sort Sheet'!E21=0,\"\",'[1]Sort Sheet'!X21)","v":5.61},{"$f":"IF('[1]Sort Sheet'!E21=0,\"\",'[1]Sort Sheet'!M21)","v":62.42},{"$f":"IF('[1]Sort Sheet'!E21=0,\"\",'[1]Sort Sheet'!Z21)","v":60.95},{"$f":"IF('[1]Sort Sheet'!E21=0,\"\",'[1]Sort Sheet'!AA21)","v":10.756676557863502},{"$f":"IF('[1]Sort Sheet'!E21=0,\"\",'[1]Sort Sheet'!AB21)","v":1732.1465504451037},{"$f":"IF('[1]Sort Sheet'!E21=0,\"\",'[1]Sort Sheet'!AC21)","v":6.5561943620178038},173.21,1905.3565504451037,7.2117961788232545]
[18,{"$f":"IF('[1]Sort Sheet'!D22=0,\"\",'[1]Sort Sheet'!D22)","v":213},{"$f":"IF('[1]Sort Sheet'!E22=0,\"\",'[1]Sort Sheet'!E22)","v":"322C"},{"$f":"IF('[1]Sort Sheet'!F22=0,\"\",'[1]Sort Sheet'!F22)","v":"M"},{"$f":"IF('[1]Sort Sheet'!E22=0,\"\",'[1]Sort Sheet'!AT22)","v":"Y"},{"$f":"IF('[1]Sort Sheet'!E22=0,\"\",'[1]Sort Sheet'!H22)","v":"Y"},{"$f":"IF('[1]Sort Sheet'!E22=0,\"\",'[1]Sort Sheet'!J22)","v":"Rich Enterprises P/L"},{"$f":"IF('[1]Sort Sheet'!E22=0,\"\",'[1]Sort Sheet'!L22)","v":"Angus / Charolais X"},{"$f":"IF('[1]Sort Sheet'!E22=0,\"\",'[1]Sort Sheet'!O22)","v":0},{"$f":"IF('[1]Sort Sheet'!P22=0,\"\",'[1]Sort Sheet'!P22)","v":279.8},{"$f":"IF('[1]Sort Sheet'!E22=0,\"\",'[1]Sort Sheet'!Q22)","v":10},{"$f":"IF('[1]Sort Sheet'!E22=0,\"\",'[1]Sort Sheet'!R22)","v":5},{"$f":"IF('[1]Sort Sheet'!E22=0,\"\",'[1]Sort Sheet'!S22)","v":86},{"$f":"IF('[1]Sort Sheet'!E22=0,\"\",'[1]Sort Sheet'!U22)","v":"3"},{"$f":"IF('[1]Sort Sheet'!E22=0,\"\",'[1]Sort Sheet'!V22)","v":2},{"$f":"IF('[1]Sort Sheet'!E22=0,\"\",'[1]Sort Sheet'!W22)","v":1},{"$f":"IF('[1]Sort Sheet'!E22=0,\"\",'[1]Sort Sheet'!X22)","v":5.68},{"$f":"IF('[1]Sort Sheet'!E22=0,\"\",'[1]Sort Sheet'!M22)","v":56.23},{"$f":"IF('[1]Sort Sheet'!E22=0,\"\",'[1]Sort Sheet'!Z22)","v":60.92},{"$f":"IF('[1]Sort Sheet'!E22=0,\"\",'[1]Sort Sheet'!AA22)","v":10.756676557863502},{"$f":"IF('[1]Sort Sheet'!E22=0,\"\",'[1]Sort Sheet'!AB22)","v":1833.5202670623146},{"$f":"IF('[1]Sort Sheet'!E22=0,\"\",'[1]Sort Sheet'!AC22)","v":6.5529673590504451},183.35,2016.8702670623145,7.2082568515450838]
[19,{"$f":"IF('[1]Sort Sheet'!D23=0,\"\",'[1]Sort Sheet'!D23)","v":262},{"$f":"IF('[1]Sort Sheet'!E23=0,\"\",'[1]Sort Sheet'!E23)","v":"342C"},{"$f":"IF('[1]Sort Sheet'!F23=0,\"\",'[1]Sort Sheet'!F23)","v":"M"},{"$f":"IF('[1]Sort Sheet'!E23=0,\"\",'[1]Sort Sheet'!AT23)","v":"Y"},{"$f":"IF('[1]Sort Sheet'!E23=0,\"\",'[1]Sort Sheet'!H23)","v":"Y"},{"$f":"IF('[1]Sort Sheet'!E23=0,\"\",'[1]Sort Sheet'!J23)","v":"Smithfield Cattle Co"},{"$f":"IF('[1]Sort Sheet'!E23=0,\"\",'[1]Sort Sheet'!L23)","v":"Angus X Murray Gray"},{"$f":"IF('[1]Sort Sheet'!E23=0,\"\",'[1]Sort Sheet'!O23)","v":0},{"$f":"IF('[1]Sort Sheet'!P23=0,\"\",'[1]Sort Sheet'!P23)","v":274.2},{"$f":"IF('[1]Sort Sheet'!E23=0,\"\",'[1]Sort Sheet'!Q23)","v":8},{"$f":"IF('[1]Sort Sheet'!E23=0,\"\",'[1]Sort Sheet'!R23)","v":4},{"$f":"IF('[1]Sort Sheet'!E23=0,\"\",'[1]Sort Sheet'!S23)","v":81},{"$f":"IF('[1]Sort Sheet'!E23=0,\"\",'[1]Sort Sheet'!U23)","v":"1b"},{"$f":"IF('[1]Sort Sheet'!E23=0,\"\",'[1]Sort Sheet'!V23)","v":2},{"$f":"IF('[1]Sort Sheet'!E23=0,\"\",'[1]Sort Sheet'!W23)","v":1},{"$f":"IF('[1]Sort Sheet'!E23=0,\"\",'[1]Sort Sheet'!X23)","v":5.53},{"$f":"IF('[1]Sort Sheet'!E23=0,\"\",'[1]Sort Sheet'!M23)","v":54.97},{"$f":"IF('[1]Sort Sheet'!E23=0,\"\",'[1]Sort Sheet'!Z23)","v":60.78},{"$f":"IF('[1]Sort Sheet'!E23=0,\"\",'[1]Sort Sheet'!AA23)","v":10.756676557863502},{"$f":"IF('[1]Sort Sheet'!E23=0,\"\",'[1]Sort Sheet'!AB23)","v":1792.6943768545993},{"$f":"IF('[1]Sort Sheet'!E23=0,\"\",'[1]Sort Sheet'!AC23)","v":6.5379080118694359},179.27,1971.9643768545993,7.1917008638023319]
[20,{"$f":"IF('[1]Sort Sheet'!D24=0,\"\",'[1]Sort Sheet'!D24)","v":294},{"$f":"IF('[1]Sort Sheet'!E24=0,\"\",'[1]Sort Sheet'!E24)","v":"349B"},{"$f":"IF('[1]Sort Sheet'!F24=0,\"\",'[1]Sort Sheet'!F24)","v":"M"},{"$f":"IF('[1]Sort Sheet'!E24=0,\"\",'[1]Sort Sheet'!AT24)","v":"Y"},{"$f":"IF('[1]Sort Sheet'!E24=0,\"\",'[1]Sort Sheet'!H24)","v":"Y"},{"$f":"IF('[1]Sort Sheet'!E24=0,\"\",'[1]Sort Sheet'!J24)","v":"B Feeders Pty ltd"},{"$f":"IF('[1]Sort Sheet'!E24=0,\"\",'[1]Sort Sheet'!L24)","v":"Charolais X Santa"},{"$f":"IF('[1]Sort Sheet'!E24=0,\"\",'[1]Sort Sheet'!O24)","v":0},{"$f":"IF('[1]Sort Sheet'!P24=0,\"\",'[1]Sort Sheet'!P24)","v":298.2},{"$f":"IF('[1]Sort Sheet'!E24=0,\"\",'[1]Sort Sheet'!Q24)","v":15},{"$f":"IF('[1]Sort Sheet'!E24=0,\"\",'[1]Sort Sheet'!R24)","v":5},{"$f":"IF('[1]Sort Sheet'!E24=0,\"\",'[1]Sort Sheet'!S24)","v":91},{"$f":"IF('[1]Sort Sheet'!E24=0,\"\",'[1]Sort Sheet'!U24)","v":"1b"},{"$f":"IF('[1]Sort Sheet'!E24=0,\"\",'[1]Sort Sheet'!V24)","v":1},{"$f":"IF('[1]Sort Sheet'!E24=0,\"\",'[1]Sort Sheet'!W24)","v":1},{"$f":"IF('[1]Sort Sheet'!E24=0,\"\",'[1]Sort Sheet'!X24)","v":5.52},{"$f":"IF('[1]Sort Sheet'!E24=0,\"\",'[1]Sort Sheet'!M24)","v":53.65},{"$f":"IF('[1]Sort Sheet'!E24=0,\"\",'[1]Sort Sheet'!Z24)","v":60.71},{"$f":"IF('[1]Sort Sheet'!E24=0,\"\",'[1]Sort Sheet'!AA24)","v":10.756676557863502},{"$f":"IF('[1]Sort Sheet'!E24=0,\"\",'[1]Sort Sheet'!AB24)","v":1947.3588204747773},{"$f":"IF('[1]Sort Sheet'!E24=0,\"\",'[1]Sort Sheet'!AC24)","v":6.5303783382789318},194.74,2142.0988204747773,7.18342998147142]
[21,{"$f":"IF('[1]Sort Sheet'!D25=0,\"\",'[1]Sort Sheet'!D25)","v":208},{"$f":"IF('[1]Sort Sheet'!E25=0,\"\",'[1]Sort Sheet'!E25)","v":"323A"},{"$f":"IF('[1]Sort Sheet'!F25=0,\"\",'[1]Sort Sheet'!F25)","v":"M"},{"$f":"IF('[1]Sort Sheet'!E25=0,\"\",'[1]Sort Sheet'!AT25)","v":"Y"},{"$f":"IF('[1]Sort Sheet'!E25=0,\"\",'[1]Sort Sheet'!H25)","v":"Y"},{"$f":"IF('[1]Sort Sheet'!E25=0,\"\",'[1]Sort Sheet'!J25)","v":"Rich Enterprises P/L"},{"$f":"IF('[1]Sort Sheet'!E25=0,\"\",'[1]Sort Sheet'!L25)","v":"Angus / Charolais X"},{"$f":"IF('[1]Sort Sheet'!E25=0,\"\",'[1]Sort Sheet'!O25)","v":0},{"$f":"IF('[1]Sort Sheet'!P25=0,\"\",'[1]Sort Sheet'!P25)","v":258},{"$f":"IF('[1]Sort Sheet'!E25=0,\"\",'[1]Sort Sheet'!Q25)","v":8},{"$f":"IF('[1]Sort Sheet'!E25=0,\"\",'[1]Sort Sheet'!R25)","v":4},{"$f":"IF('[1]Sort Sheet'!E25=0,\"\",'[1]Sort Sheet'!S25)","v":77},{"$f":"IF('[1]Sort Sheet'!E25=0,\"\",'[1]Sort Sheet'!U25)","v":"2"},{"$f":"IF('[1]Sort Sheet'!E25=0,\"\",'[1]Sort Sheet'!V25)","v":1},{"$f":"IF('[1]Sort Sheet'!E25=0,\"\",'[1]Sort Sheet'!W25)","v":1},{"$f":"IF('[1]Sort Sheet'!E25=0,\"\",'[1]Sort Sheet'!X25)","v":5.47},{"$f":"IF('[1]Sort Sheet'!E25=0,\"\",'[1]Sort Sheet'!M25)","v":55.73},{"$f":"IF('[1]Sort Sheet'!E25=0,\"\",'[1]Sort Sheet'!Z25)","v":60.67},{"$f":"IF('[1]Sort Sheet'!E25=0,\"\",'[1]Sort Sheet'!AA25)","v":10.756676557863502},{"$f":"IF('[1]Sort Sheet'!E25=0,\"\",'[1]Sort Sheet'!AB25)","v":1683.727522255193},{"$f":"IF('[1]Sort Sheet'!E25=0,\"\",'[1]Sort Sheet'!AC25)","v":6.5260756676557872},168.37,1852.0975222551929,7.1786725668805929]
[22,{"$f":"IF('[1]Sort Sheet'!D26=0,\"\",'[1]Sort Sheet'!D26)","v":207},{"$f":"IF('[1]Sort Sheet'!E26=0,\"\",'[1]Sort Sheet'!E26)","v":"320B"},{"$f":"IF('[1]Sort Sheet'!F26=0,\"\",'[1]Sort Sheet'!F26)","v":"M"},{"$f":"IF('[1]Sort Sheet'!E26=0,\"\",'[1]Sort Sheet'!AT26)","v":"Y"},{"$f":"IF('[1]Sort Sheet'!E26=0,\"\",'[1]Sort Sheet'!H26)","v":"Y"},{"$f":"IF('[1]Sort Sheet'!E26=0,\"\",'[1]Sort Sheet'!J26)","v":"Darr Creek Pastoral"},{"$f":"IF('[1]Sort Sheet'!E26=0,\"\",'[1]Sort Sheet'!L26)","v":"Angus/Hereford X Limousin"},{"$f":"IF('[1]Sort Sheet'!E26=0,\"\",'[1]Sort Sheet'!O26)","v":0},{"$f":"IF('[1]Sort Sheet'!P26=0,\"\",'[1]Sort Sheet'!P26)","v":270.8},{"$f":"IF('[1]Sort Sheet'!E26=0,\"\",'[1]Sort Sheet'!Q26)","v":12},{"$f":"IF('[1]Sort Sheet'!E26=0,\"\",'[1]Sort Sheet'!R26)","v":5},{"$f":"IF('[1]Sort Sheet'!E26=0,\"\",'[1]Sort Sheet'!S26)","v":83},{"$f":"IF('[1]Sort Sheet'!E26=0,\"\",'[1]Sort Sheet'!U26)","v":"1b"},{"$f":"IF('[1]Sort Sheet'!E26=0,\"\",'[1]Sort Sheet'!V26)","v":1},{"$f":"IF('[1]Sort Sheet'!E26=0,\"\",'[1]Sort Sheet'!W26)","v":1},{"$f":"IF('[1]Sort Sheet'!E26=0,\"\",'[1]Sort Sheet'!X26)","v":5.4},{"$f":"IF('[1]Sort Sheet'!E26=0,\"\",'[1]Sort Sheet'!M26)","v":56.18},{"$f":"IF('[1]Sort Sheet'!E26=0,\"\",'[1]Sort Sheet'!Z26)","v":60.54},{"$f":"IF('[1]Sort Sheet'!E26=0,\"\",'[1]Sort Sheet'!AA26)","v":10.756676557863502},{"$f":"IF('[1]Sort Sheet'!E26=0,\"\",'[1]Sort Sheet'!AB26)","v":1763.4745103857567},{"$f":"IF('[1]Sort Sheet'!E26=0,\"\",'[1]Sort Sheet'!AC26)","v":6.5120919881305639},176.35,1939.8245103857566,7.1633105996519815]
[23,{"$f":"IF('[1]Sort Sheet'!D27=0,\"\",'[1]Sort Sheet'!D27)","v":226},{"$f":"IF('[1]Sort Sheet'!E27=0,\"\",'[1]Sort Sheet'!E27)","v":"330C"},{"$f":"IF('[1]Sort Sheet'!F27=0,\"\",'[1]Sort Sheet'!F27)","v":"M"},{"$f":"IF('[1]Sort Sheet'!E27=0,\"\",'[1]Sort Sheet'!AT27)","v":"Y"},{"$f":"IF('[1]Sort Sheet'!E27=0,\"\",'[1]Sort Sheet'!H27)","v":"Y"},{"$f":"IF('[1]Sort Sheet'!E27=0,\"\",'[1]Sort Sheet'!J27)","v":"Juandah Grazing"},{"$f":"IF('[1]Sort Sheet'!E27=0,\"\",'[1]Sort Sheet'!L27)","v":"Charolais X Droughtmaster"},{"$f":"IF('[1]Sort Sheet'!E27=0,\"\",'[1]Sort Sheet'!O27)","v":0},{"$f":"IF('[1]Sort Sheet'!P27=0,\"\",'[1]Sort Sheet'!P27)","v":263.39999999999998},{"$f":"IF('[1]Sort Sheet'!E27=0,\"\",'[1]Sort Sheet'!Q27)","v":10},{"$f":"IF('[1]Sort Sheet'!E27=0,\"\",'[1]Sort Sheet'!R27)","v":4},{"$f":"IF('[1]Sort Sheet'!E27=0,\"\",'[1]Sort Sheet'!S27)","v":76},{"$f":"IF('[1]Sort Sheet'!E27=0,\"\",'[1]Sort Sheet'!U27)","v":"3"},{"$f":"IF('[1]Sort Sheet'!E27=0,\"\",'[1]Sort Sheet'!V27)","v":1},{"$f":"IF('[1]Sort Sheet'!E27=0,\"\",'[1]Sort Sheet'!W27)","v":0},{"$f":"IF('[1]Sort Sheet'!E27=0,\"\",'[1]Sort Sheet'!X27)","v":5.56},{"$f":"IF('[1]Sort Sheet'!E27=0,\"\",'[1]Sort Sheet'!M27)","v":54.13},{"$f":"IF('[1]Sort Sheet'!E27=0,\"\",'[1]Sort Sheet'!Z27)","v":60.42},{"$f":"IF('[1]Sort Sheet'!E27=0,\"\",'[1]Sort Sheet'!AA27)","v":10.756676557863502},{"$f":"IF('[1]Sort Sheet'!E27=0,\"\",'[1]Sort Sheet'!AB27)","v":1711.8850593471809},{"$f":"IF('[1]Sort Sheet'!E27=0,\"\",'[1]Sort Sheet'!AC27)","v":6.4991839762611274},171.19,1883.075059347181,7.1491080461168606]
[24,{"$f":"IF('[1]Sort Sheet'!D28=0,\"\",'[1]Sort Sheet'!D28)","v":205},{"$f":"IF('[1]Sort Sheet'!E28=0,\"\",'[1]Sort Sheet'!E28)","v":"319A"},{"$f":"IF('[1]Sort Sheet'!F28=0,\"\",'[1]Sort Sheet'!F28)","v":"M"},{"$f":"IF('[1]Sort Sheet'!E28=0,\"\",'[1]Sort Sheet'!AT28)","v":"Y"},{"$f":"IF('[1]Sort Sheet'!E28=0,\"\",'[1]Sort Sheet'!H28)","v":"Y"},{"$f":"IF('[1]Sort Sheet'!E28=0,\"\",'[1]Sort Sheet'!J28)","v":"Darr Creek Pastoral"},{"$f":"IF('[1]Sort Sheet'!E28=0,\"\",'[1]Sort Sheet'!L28)","v":"Angus X Limousin"},{"$f":"IF('[1]Sort Sheet'!E28=0,\"\",'[1]Sort Sheet'!O28)","v":0},{"$f":"IF('[1]Sort Sheet'!P28=0,\"\",'[1]Sort Sheet'!P28)","v":259.39999999999998},{"$f":"IF('[1]Sort Sheet'!E28=0,\"\",'[1]Sort Sheet'!Q28)","v":8},{"$f":"IF('[1]Sort Sheet'!E28=0,\"\",'[1]Sort Sheet'!R28)","v":7},{"$f":"IF('[1]Sort Sheet'!E28=0,\"\",'[1]Sort Sheet'!S28)","v":84},{"$f":"IF('[1]Sort Sheet'!E28=0,\"\",'[1]Sort Sheet'!U28)","v":"2"},{"$f":"IF('[1]Sort Sheet'!E28=0,\"\",'[1]Sort Sheet'!V28)","v":1},{"$f":"IF('[1]Sort Sheet'!E28=0,\"\",'[1]Sort Sheet'!W28)","v":1},{"$f":"IF('[1]Sort Sheet'!E28=0,\"\",'[1]Sort Sheet'!X28)","v":5.61},{"$f":"IF('[1]Sort Sheet'!E28=0,\"\",'[1]Sort Sheet'!M28)","v":56.48},{"$f":"IF('[1]Sort Sheet'!E28=0,\"\",'[1]Sort Sheet'!Z28)","v":60.38},{"$f":"IF('[1]Sort Sheet'!E28=0,\"\",'[1]Sort Sheet'!AA28)","v":10.756676557863502},{"$f":"IF('[1]Sort Sheet'!E28=0,\"\",'[1]Sort Sheet'!AB28)","v":1684.7722106824926},{"$f":"IF('[1]Sort Sheet'!E28=0,\"\",'[1]Sort Sheet'!AC28)","v":6.4948813056379828},168.48,1853.2522106824927,7.1443801491229486]
[25,{"$f":"IF('[1]Sort Sheet'!D29=0,\"\",'[1]Sort Sheet'!D29)","v":222},{"$f":"IF('[1]Sort Sheet'!E29=0,\"\",'[1]Sort Sheet'!E29)","v":"324A"},{"$f":"IF('[1]Sort Sheet'!F29=0,\"\",'[1]Sort Sheet'!F29)","v":"F"},{"$f":"IF('[1]Sort Sheet'!E29=0,\"\",'[1]Sort Sheet'!AT29)","v":"Y"},{"$f":"IF('[1]Sort Sheet'!E29=0,\"\",'[1]Sort Sheet'!H29)","v":"Y"},{"$f":"IF('[1]Sort Sheet'!E29=0,\"\",'[1]Sort Sheet'!J29)","v":"R S & K M  Stevens Family Trust "},{"$f":"IF('[1]Sort Sheet'!E29=0,\"\",'[1]Sort Sheet'!L29)","v":"Charolais X Angus"},{"$f":"IF('[1]Sort Sheet'!E29=0,\"\",'[1]Sort Sheet'!O29)","v":0},{"$f":"IF('[1]Sort Sheet'!P29=0,\"\",'[1]Sort Sheet'!P29)","v":276.8},{"$f":"IF('[1]Sort Sheet'!E29=0,\"\",'[1]Sort Sheet'!Q29)","v":11},{"$f":"IF('[1]Sort Sheet'!E29=0,\"\",'[1]Sort Sheet'!R29)","v":6},{"$f":"IF('[1]Sort Sheet'!E29=0,\"\",'[1]Sort Sheet'!S29)","v":101},{"$f":"IF('[1]Sort Sheet'!E29=0,\"\",'[1]Sort Sheet'!U29)","v":"1b"},{"$f":"IF('[1]Sort Sheet'!E29=0,\"\",'[1]Sort Sheet'!V29)","v":1},{"$f":"IF('[1]Sort Sheet'!E29=0,\"\",'[1]Sort Sheet'!W29)","v":1},{"$f":"IF('[1]Sort Sheet'!E29=0,\"\",'[1]Sort Sheet'!X29)","v":5.48},{"$f":"IF('[1]Sort Sheet'!E29=0,\"\",'[1]Sort Sheet'!M29)","v":54.72},{"$f":"IF('[1]Sort Sheet'!E29=0,\"\",'[1]Sort Sheet'!Z29)","v":60.29},{"$f":"IF('[1]Sort Sheet'!E29=0,\"\",'[1]Sort Sheet'!AA29)","v":10.756676557863502},{"$f":"IF('[1]Sort Sheet'!E29=0,\"\",'[1]Sort Sheet'!AB29)","v":1795.1034421364986},{"$f":"IF('[1]Sort Sheet'!E29=0,\"\",'[1]Sort Sheet'!AC29)","v":6.485200296735905},179.51,1974.6134421364986,7.133719082863073]
[26,{"$f":"IF('[1]Sort Sheet'!D30=0,\"\",'[1]Sort Sheet'!D30)","v":211},{"$f":"IF('[1]Sort Sheet'!E30=0,\"\",'[1]Sort Sheet'!E30)","v":"323C"},{"$f":"IF('[1]Sort Sheet'!F30=0,\"\",'[1]Sort Sheet'!F30)","v":"M"},{"$f":"IF('[1]Sort Sheet'!E30=0,\"\",'[1]Sort Sheet'!AT30)","v":"Y"},{"$f":"IF('[1]Sort Sheet'!E30=0,\"\",'[1]Sort Sheet'!H30)","v":"Y"},{"$f":"IF('[1]Sort Sheet'!E30=0,\"\",'[1]Sort Sheet'!J30)","v":"Rich Enterprises P/L"},{"$f":"IF('[1]Sort Sheet'!E30=0,\"\",'[1]Sort Sheet'!L30)","v":"Angus / Charolais X"},{"$f":"IF('[1]Sort Sheet'!E30=0,\"\",'[1]Sort Sheet'!O30)","v":0},{"$f":"IF('[1]Sort Sheet'!P30=0,\"\",'[1]Sort Sheet'!P30)","v":272},{"$f":"IF('[1]Sort Sheet'!E30=0,\"\",'[1]Sort Sheet'!Q30)","v":6},{"$f":"IF('[1]Sort Sheet'!E30=0,\"\",'[1]Sort Sheet'!R30)","v":5},{"$f":"IF('[1]Sort Sheet'!E30=0,\"\",'[1]Sort Sheet'!S30)","v":80},{"$f":"IF('[1]Sort Sheet'!E30=0,\"\",'[1]Sort Sheet'!U30)","v":"1b"},{"$f":"IF('[1]Sort Sheet'!E30=0,\"\",'[1]Sort Sheet'!V30)","v":1},{"$f":"IF('[1]Sort Sheet'!E30=0,\"\",'[1]Sort Sheet'!W30)","v":1},{"$f":"IF('[1]Sort Sheet'!E30=0,\"\",'[1]Sort Sheet'!X30)","v":5.5},{"$f":"IF('[1]Sort Sheet'!E30=0,\"\",'[1]Sort Sheet'!M30)","v":55.54},{"$f":"IF('[1]Sort Sheet'!E30=0,\"\",'[1]Sort Sheet'!Z30)","v":60.18},{"$f":"IF('[1]Sort Sheet'!E30=0,\"\",'[1]Sort Sheet'!AA30)","v":10.756676557863502},{"$f":"IF('[1]Sort Sheet'!E30=0,\"\",'[1]Sort Sheet'!AB30)","v":1760.7560830860532},{"$f":"IF('[1]Sort Sheet'!E30=0,\"\",'[1]Sort Sheet'!AC30)","v":6.4733679525222545},176.08,1936.8360830860531,7.1207208936987243]
[27,{"$f":"IF('[1]Sort Sheet'!D31=0,\"\",'[1]Sort Sheet'!D31)","v":264},{"$f":"IF('[1]Sort Sheet'!E31=0,\"\",'[1]Sort Sheet'!E31)","v":"341C"},{"$f":"IF('[1]Sort Sheet'!F31=0,\"\",'[1]Sort Sheet'!F31)","v":"M"},{"$f":"IF('[1]Sort Sheet'!E31=0,\"\",'[1]Sort Sheet'!AT31)","v":"Y"},{"$f":"IF('[1]Sort Sheet'!E31=0,\"\",'[1]Sort Sheet'!H31)","v":"Y"},{"$f":"IF('[1]Sort Sheet'!E31=0,\"\",'[1]Sort Sheet'!J31)","v":"Smithfield Cattle Co"},{"$f":"IF('[1]Sort Sheet'!E31=0,\"\",'[1]Sort Sheet'!L31)","v":"Santa X Murray Grey"},{"$f":"IF('[1]Sort Sheet'!E31=0,\"\",'[1]Sort Sheet'!O31)","v":0},{"$f":"IF('[1]Sort Sheet'!P31=0,\"\",'[1]Sort Sheet'!P31)","v":303.8},{"$f":"IF('[1]Sort Sheet'!E31=0,\"\",'[1]Sort Sheet'!Q31)","v":6},{"$f":"IF('[1]Sort Sheet'!E31=0,\"\",'[1]Sort Sheet'!R31)","v":4},{"$f":"IF('[1]Sort Sheet'!E31=0,\"\",'[1]Sort Sheet'!S31)","v":87},{"$f":"IF('[1]Sort Sheet'!E31=0,\"\",'[1]Sort Sheet'!U31)","v":"2"},{"$f":"IF('[1]Sort Sheet'!E31=0,\"\",'[1]Sort Sheet'!V31)","v":2},{"$f":"IF('[1]Sort Sheet'!E31=0,\"\",'[1]Sort Sheet'!W31)","v":1},{"$f":"IF('[1]Sort Sheet'!E31=0,\"\",'[1]Sort Sheet'!X31)","v":5.62},{"$f":"IF('[1]Sort Sheet'!E31=0,\"\",'[1]Sort Sheet'!M31)","v":55.79},{"$f":"IF('[1]Sort Sheet'!E31=0,\"\",'[1]Sort Sheet'!Z31)","v":60.14},{"$f":"IF('[1]Sort Sheet'!E31=0,\"\",'[1]Sort Sheet'!AA31)","v":10.756676557863502},{"$f":"IF('[1]Sort Sheet'!E31=0,\"\",'[1]Sort Sheet'!AB31)","v":1965.3020326409494},{"$f":"IF('[1]Sort Sheet'!E31=0,\"\",'[1]Sort Sheet'!AC31)","v":6.469065281899109},196.53,2161.8320326409494,7.1159711410169493]
[28,{"$f":"IF('[1]Sort Sheet'!D32=0,\"\",'[1]Sort Sheet'!D32)","v":297},{"$f":"IF('[1]Sort Sheet'!E32=0,\"\",'[1]Sort Sheet'!E32)","v":"351C"},{"$f":"IF('[1]Sort Sheet'!F32=0,\"\",'[1]Sort Sheet'!F32)","v":"M"},{"$f":"IF('[1]Sort Sheet'!E32=0,\"\",'[1]Sort Sheet'!AT32)","v":"Y"},{"$f":"IF('[1]Sort Sheet'!E32=0,\"\",'[1]Sort Sheet'!H32)","v":"Y"},{"$f":"IF('[1]Sort Sheet'!E32=0,\"\",'[1]Sort Sheet'!J32)","v":"B Feeders Pty ltd"},{"$f":"IF('[1]Sort Sheet'!E32=0,\"\",'[1]Sort Sheet'!L32)","v":"Charolais X Santa"},{"$f":"IF('[1]Sort Sheet'!E32=0,\"\",'[1]Sort Sheet'!O32)","v":0},{"$f":"IF('[1]Sort Sheet'!P32=0,\"\",'[1]Sort Sheet'!P32)","v":298.39999999999998},{"$f":"IF('[1]Sort Sheet'!E32=0,\"\",'[1]Sort Sheet'!Q32)","v":21},{"$f":"IF('[1]Sort Sheet'!E32=0,\"\",'[1]Sort Sheet'!R32)","v":4},{"$f":"IF('[1]Sort Sheet'!E32=0,\"\",'[1]Sort Sheet'!S32)","v":86},{"$f":"IF('[1]Sort Sheet'!E32=0,\"\",'[1]Sort Sheet'!U32)","v":"1b"},{"$f":"IF('[1]Sort Sheet'!E32=0,\"\",'[1]Sort Sheet'!V32)","v":1},{"$f":"IF('[1]Sort Sheet'!E32=0,\"\",'[1]Sort Sheet'!W32)","v":1},{"$f":"IF('[1]Sort Sheet'!E32=0,\"\",'[1]Sort Sheet'!X32)","v":5.62},{"$f":"IF('[1]Sort Sheet'!E32=0,\"\",'[1]Sort Sheet'!M32)","v":53.02},{"$f":"IF('[1]Sort Sheet'!E32=0,\"\",'[1]Sort Sheet'!Z32)","v":60.1},{"$f":"IF('[1]Sort Sheet'!E32=0,\"\",'[1]Sort Sheet'!AA32)","v":10.756676557863502},{"$f":"IF('[1]Sort Sheet'!E32=0,\"\",'[1]Sort Sheet'!AB32)","v":1929.0851632047479},{"$f":"IF('[1]Sort Sheet'!E32=0,\"\",'[1]Sort Sheet'!AC32)","v":6.4647626112759653},192.91,2121.9951632047478,7.1112438445199331]
[29,{"$f":"IF('[1]Sort Sheet'!D33=0,\"\",'[1]Sort Sheet'!D33)","v":295},{"$f":"IF('[1]Sort Sheet'!E33=0,\"\",'[1]Sort Sheet'!E33)","v":"350B"},{"$f":"IF('[1]Sort Sheet'!F33=0,\"\",'[1]Sort Sheet'!F33)","v":"M"},{"$f":"IF('[1]Sort Sheet'!E33=0,\"\",'[1]Sort Sheet'!AT33)","v":"Y"},{"$f":"IF('[1]Sort Sheet'!E33=0,\"\",'[1]Sort Sheet'!H33)","v":"Y"},{"$f":"IF('[1]Sort Sheet'!E33=0,\"\",'[1]Sort Sheet'!J33)","v":"B Feeders Pty ltd"},{"$f":"IF('[1]Sort Sheet'!E33=0,\"\",'[1]Sort Sheet'!L33)","v":"Santa"},{"$f":"IF('[1]Sort Sheet'!E33=0,\"\",'[1]Sort Sheet'!O33)","v":0},{"$f":"IF('[1]Sort Sheet'!P33=0,\"\",'[1]Sort Sheet'!P33)","v":296.60000000000002},{"$f":"IF('[1]Sort Sheet'!E33=0,\"\",'[1]Sort Sheet'!Q33)","v":10},{"$f":"IF('[1]Sort Sheet'!E33=0,\"\",'[1]Sort Sheet'!R33)","v":5},{"$f":"IF('[1]Sort Sheet'!E33=0,\"\",'[1]Sort Sheet'!S33)","v":86},{"$f":"IF('[1]Sort Sheet'!E33=0,\"\",'[1]Sort Sheet'!U33)","v":"1b"},{"$f":"IF('[1]Sort Sheet'!E33=0,\"\",'[1]Sort Sheet'!V33)","v":1},{"$f":"IF('[1]Sort Sheet'!E33=0,\"\",'[1]Sort Sheet'!W33)","v":1},{"$f":"IF('[1]Sort Sheet'!E33=0,\"\",'[1]Sort Sheet'!X33)","v":5.55},{"$f":"IF('[1]Sort Sheet'!E33=0,\"\",'[1]Sort Sheet'!M33)","v":53.21},{"$f":"IF('[1]Sort Sheet'!E33=0,\"\",'[1]Sort Sheet'!Z33)","v":60.09},{"$f":"IF('[1]Sort Sheet'!E33=0,\"\",'[1]Sort Sheet'!AA33)","v":10.756676557863502},{"$f":"IF('[1]Sort Sheet'!E33=0,\"\",'[1]Sort Sheet'!AB33)","v":1917.1295474777453},{"$f":"IF('[1]Sort Sheet'!E33=0,\"\",'[1]Sort Sheet'!AC33)","v":6.4636869436201794},191.71,2108.8395474777453,7.1100456759195723]
[30,{"$f":"IF('[1]Sort Sheet'!D34=0,\"\",'[1]Sort Sheet'!D34)","v":232},{"$f":"IF('[1]Sort Sheet'!E34=0,\"\",'[1]Sort Sheet'!E34)","v":"329A"},{"$f":"IF('[1]Sort Sheet'!F34=0,\"\",'[1]Sort Sheet'!F34)","v":"F"},{"$f":"IF('[1]Sort Sheet'!E34=0,\"\",'[1]Sort Sheet'!AT34)","v":"Y"},{"$f":"IF('[1]Sort Sheet'!E34=0,\"\",'[1]Sort Sheet'!H34)","v":"Y"},{"$f":"IF('[1]Sort Sheet'!E34=0,\"\",'[1]Sort Sheet'!J34)","v":"Juandah Grazing"},{"$f":"IF('[1]Sort Sheet'!E34=0,\"\",'[1]Sort Sheet'!L34)","v":"Charolais X Droughtmaster"},{"$f":"IF('[1]Sort Sheet'!E34=0,\"\",'[1]Sort Sheet'!O34)","v":0},{"$f":"IF('[1]Sort Sheet'!P34=0,\"\",'[1]Sort Sheet'!P34)","v":258.2},{"$f":"IF('[1]Sort Sheet'!E34=0,\"\",'[1]Sort Sheet'!Q34)","v":10},{"$f":"IF('[1]Sort Sheet'!E34=0,\"\",'[1]Sort Sheet'!R34)","v":6},{"$f":"IF('[1]Sort Sheet'!E34=0,\"\",'[1]Sort Sheet'!S34)","v":96},{"$f":"IF('[1]Sort Sheet'!E34=0,\"\",'[1]Sort Sheet'!U34)","v":"3"},{"$f":"IF('[1]Sort Sheet'!E34=0,\"\",'[1]Sort Sheet'!V34)","v":2},{"$f":"IF('[1]Sort Sheet'!E34=0,\"\",'[1]Sort Sheet'!W34)","v":1},{"$f":"IF('[1]Sort Sheet'!E34=0,\"\",'[1]Sort Sheet'!X34)","v":5.57},{"$f":"IF('[1]Sort Sheet'!E34=0,\"\",'[1]Sort Sheet'!M34)","v":54.57},{"$f":"IF('[1]Sort Sheet'!E34=0,\"\",'[1]Sort Sheet'!Z34)","v":60.08},{"$f":"IF('[1]Sort Sheet'!E34=0,\"\",'[1]Sort Sheet'!AA34)","v":10.756676557863502},{"$f":"IF('[1]Sort Sheet'!E34=0,\"\",'[1]Sort Sheet'!AB34)","v":1668.6462314540058},{"$f":"IF('[1]Sort Sheet'!E34=0,\"\",'[1]Sort Sheet'!AC34)","v":6.4626112759643917},166.86,1835.506231454006,7.10885449827268]
[31,{"$f":"IF('[1]Sort Sheet'!D35=0,\"\",'[1]Sort Sheet'!D35)","v":265},{"$f":"IF('[1]Sort Sheet'!E35=0,\"\",'[1]Sort Sheet'!E35)","v":"342B"},{"$f":"IF('[1]Sort Sheet'!F35=0,\"\",'[1]Sort Sheet'!F35)","v":"M"},{"$f":"IF('[1]Sort Sheet'!E35=0,\"\",'[1]Sort Sheet'!AT35)","v":"Y"},{"$f":"IF('[1]Sort Sheet'!E35=0,\"\",'[1]Sort Sheet'!H35)","v":"Y"},{"$f":"IF('[1]Sort Sheet'!E35=0,\"\",'[1]Sort Sheet'!J35)","v":"Smithfield Cattle Co"},{"$f":"IF('[1]Sort Sheet'!E35=0,\"\",'[1]Sort Sheet'!L35)","v":"Angus X Murray Gray"},{"$f":"IF('[1]Sort Sheet'!E35=0,\"\",'[1]Sort Sheet'!O35)","v":0},{"$f":"IF('[1]Sort Sheet'!P35=0,\"\",'[1]Sort Sheet'!P35)","v":274},{"$f":"IF('[1]Sort Sheet'!E35=0,\"\",'[1]Sort Sheet'!Q35)","v":10},{"$f":"IF('[1]Sort Sheet'!E35=0,\"\",'[1]Sort Sheet'!R35)","v":6},{"$f":"IF('[1]Sort Sheet'!E35=0,\"\",'[1]Sort Sheet'!S35)","v":83},{"$f":"IF('[1]Sort Sheet'!E35=0,\"\",'[1]Sort Sheet'!U35)","v":"2"},{"$f":"IF('[1]Sort Sheet'!E35=0,\"\",'[1]Sort Sheet'!V35)","v":2},{"$f":"IF('[1]Sort Sheet'!E35=0,\"\",'[1]Sort Sheet'!W35)","v":1},{"$f":"IF('[1]Sort Sheet'!E35=0,\"\",'[1]Sort Sheet'!X35)","v":5.6},{"$f":"IF('[1]Sort Sheet'!E35=0,\"\",'[1]Sort Sheet'!M35)","v":56.06},{"$f":"IF('[1]Sort Sheet'!E35=0,\"\",'[1]Sort Sheet'!Z35)","v":59.94},{"$f":"IF('[1]Sort Sheet'!E35=0,\"\",'[1]Sort Sheet'!AA35)","v":10.756676557863502},{"$f":"IF('[1]Sort Sheet'!E35=0,\"\",'[1]Sort Sheet'!AB35)","v":1766.6292284866465},{"$f":"IF('[1]Sort Sheet'!E35=0,\"\",'[1]Sort Sheet'!AC35)","v":6.4475519287833816},176.66,1943.2892284866466,7.0922964543308273]
[32,{"$f":"IF('[1]Sort Sheet'!D36=0,\"\",'[1]Sort Sheet'!D36)","v":256},{"$f":"IF('[1]Sort Sheet'!E36=0,\"\",'[1]Sort Sheet'!E36)","v":"338B"},{"$f":"IF('[1]Sort Sheet'!F36=0,\"\",'[1]Sort Sheet'!F36)","v":"F"},{"$f":"IF('[1]Sort Sheet'!E36=0,\"\",'[1]Sort Sheet'!AT36)","v":"Y"},{"$f":"IF('[1]Sort Sheet'!E36=0,\"\",'[1]Sort Sheet'!H36)","v":"Y"},{"$f":"IF('[1]Sort Sheet'!E36=0,\"\",'[1]Sort Sheet'!J36)","v":"RB & VA Budd & Willoise Grazing Co Pty Ltd"},{"$f":"IF('[1]Sort Sheet'!E36=0,\"\",'[1]Sort Sheet'!L36)","v":"Charolais X"},{"$f":"IF('[1]Sort Sheet'!E36=0,\"\",'[1]Sort Sheet'!O36)","v":0},{"$f":"IF('[1]Sort Sheet'!P36=0,\"\",'[1]Sort Sheet'!P36)","v":224.6},{"$f":"IF('[1]Sort Sheet'!E36=0,\"\",'[1]Sort Sheet'!Q36)","v":6},{"$f":"IF('[1]Sort Sheet'!E36=0,\"\",'[1]Sort Sheet'!R36)","v":3},{"$f":"IF('[1]Sort Sheet'!E36=0,\"\",'[1]Sort Sheet'!S36)","v":75},{"$f":"IF('[1]Sort Sheet'!E36=0,\"\",'[1]Sort Sheet'!U36)","v":"2"},{"$f":"IF('[1]Sort Sheet'!E36=0,\"\",'[1]Sort Sheet'!V36)","v":1},{"$f":"IF('[1]Sort Sheet'!E36=0,\"\",'[1]Sort Sheet'!W36)","v":0},{"$f":"IF('[1]Sort Sheet'!E36=0,\"\",'[1]Sort Sheet'!X36)","v":5.63},{"$f":"IF('[1]Sort Sheet'!E36=0,\"\",'[1]Sort Sheet'!M36)","v":53.14},{"$f":"IF('[1]Sort Sheet'!E36=0,\"\",'[1]Sort Sheet'!Z36)","v":59.81},{"$f":"IF('[1]Sort Sheet'!E36=0,\"\",'[1]Sort Sheet'!AA36)","v":10.756676557863502},{"$f":"IF('[1]Sort Sheet'!E36=0,\"\",'[1]Sort Sheet'!AB36)","v":1444.9794287833831},{"$f":"IF('[1]Sort Sheet'!E36=0,\"\",'[1]Sort Sheet'!AC36)","v":6.4335682492581618},144.5,1589.4794287833831,7.0769342332296672]
[33,{"$f":"IF('[1]Sort Sheet'!D37=0,\"\",'[1]Sort Sheet'!D37)","v":220},{"$f":"IF('[1]Sort Sheet'!E37=0,\"\",'[1]Sort Sheet'!E37)","v":"325C"},{"$f":"IF('[1]Sort Sheet'!F37=0,\"\",'[1]Sort Sheet'!F37)","v":"F"},{"$f":"IF('[1]Sort Sheet'!E37=0,\"\",'[1]Sort Sheet'!AT37)","v":"Y"},{"$f":"IF('[1]Sort Sheet'!E37=0,\"\",'[1]Sort Sheet'!H37)","v":"Y"},{"$f":"IF('[1]Sort Sheet'!E37=0,\"\",'[1]Sort Sheet'!J37)","v":"R S & K M  Stevens Family Trust "},{"$f":"IF('[1]Sort Sheet'!E37=0,\"\",'[1]Sort Sheet'!L37)","v":"Charolais X Brangus"},{"$f":"IF('[1]Sort Sheet'!E37=0,\"\",'[1]Sort Sheet'!O37)","v":0},{"$f":"IF('[1]Sort Sheet'!P37=0,\"\",'[1]Sort Sheet'!P37)","v":244},{"$f":"IF('[1]Sort Sheet'!E37=0,\"\",'[1]Sort Sheet'!Q37)","v":10},{"$f":"IF('[1]Sort Sheet'!E37=0,\"\",'[1]Sort Sheet'!R37)","v":6},{"$f":"IF('[1]Sort Sheet'!E37=0,\"\",'[1]Sort Sheet'!S37)","v":90},{"$f":"IF('[1]Sort Sheet'!E37=0,\"\",'[1]Sort Sheet'!U37)","v":"2"},{"$f":"IF('[1]Sort Sheet'!E37=0,\"\",'[1]Sort Sheet'!V37)","v":1},{"$f":"IF('[1]Sort Sheet'!E37=0,\"\",'[1]Sort Sheet'!W37)","v":1},{"$f":"IF('[1]Sort Sheet'!E37=0,\"\",'[1]Sort Sheet'!X37)","v":5.55},{"$f":"IF('[1]Sort Sheet'!E37=0,\"\",'[1]Sort Sheet'!M37)","v":53.7},{"$f":"IF('[1]Sort Sheet'!E37=0,\"\",'[1]Sort Sheet'!Z37)","v":59.8},{"$f":"IF('[1]Sort Sheet'!E37=0,\"\",'[1]Sort Sheet'!AA37)","v":10.756676557863502},{"$f":"IF('[1]Sort Sheet'!E37=0,\"\",'[1]Sort Sheet'!AB37)","v":1569.5281899109791},{"$f":"IF('[1]Sort Sheet'!E37=0,\"\",'[1]Sort Sheet'!AC37)","v":6.4324925816023732},156.94999999999999,1726.4781899109792,7.0757302865204066]
[34,{"$f":"IF('[1]Sort Sheet'!D38=0,\"\",'[1]Sort Sheet'!D38)","v":192},{"$f":"IF('[1]Sort Sheet'!E38=0,\"\",'[1]Sort Sheet'!E38)","v":"316A"},{"$f":"IF('[1]Sort Sheet'!F38=0,\"\",'[1]Sort Sheet'!F38)","v":"M"},{"$f":"IF('[1]Sort Sheet'!E38=0,\"\",'[1]Sort Sheet'!AT38)","v":"Y"},{"$f":"IF('[1]Sort Sheet'!E38=0,\"\",'[1]Sort Sheet'!H38)","v":"Y"},{"$f":"IF('[1]Sort Sheet'!E38=0,\"\",'[1]Sort Sheet'!J38)","v":"Riverglen Pastoral Company"},{"$f":"IF('[1]Sort Sheet'!E38=0,\"\",'[1]Sort Sheet'!L38)","v":"Charolais X"},{"$f":"IF('[1]Sort Sheet'!E38=0,\"\",'[1]Sort Sheet'!O38)","v":2},{"$f":"IF('[1]Sort Sheet'!P38=0,\"\",'[1]Sort Sheet'!P38)","v":293.60000000000002},{"$f":"IF('[1]Sort Sheet'!E38=0,\"\",'[1]Sort Sheet'!Q38)","v":12},{"$f":"IF('[1]Sort Sheet'!E38=0,\"\",'[1]Sort Sheet'!R38)","v":4},{"$f":"IF('[1]Sort Sheet'!E38=0,\"\",'[1]Sort Sheet'!S38)","v":80},{"$f":"IF('[1]Sort Sheet'!E38=0,\"\",'[1]Sort Sheet'!U38)","v":"2"},{"$f":"IF('[1]Sort Sheet'!E38=0,\"\",'[1]Sort Sheet'!V38)","v":1},{"$f":"IF('[1]Sort Sheet'!E38=0,\"\",'[1]Sort Sheet'!W38)","v":1},{"$f":"IF('[1]Sort Sheet'!E38=0,\"\",'[1]Sort Sheet'!X38)","v":5.57},{"$f":"IF('[1]Sort Sheet'!E38=0,\"\",'[1]Sort Sheet'!M38)","v":61.02},{"$f":"IF('[1]Sort Sheet'!E38=0,\"\",'[1]Sort Sheet'!Z38)","v":59.76},{"$f":"IF('[1]Sort Sheet'!E38=0,\"\",'[1]Sort Sheet'!AA38)","v":10.756676557863502},{"$f":"IF('[1]Sort Sheet'!E38=0,\"\",'[1]Sort Sheet'!AB38)","v":1887.3165578635017},{"$f":"IF('[1]Sort Sheet'!E38=0,\"\",'[1]Sort Sheet'!AC38)","v":6.4281899109792286},188.73,2076.0465578635017,7.0710032624778663]
[35,{"$f":"IF('[1]Sort Sheet'!D39=0,\"\",'[1]Sort Sheet'!D39)","v":209},{"$f":"IF('[1]Sort Sheet'!E39=0,\"\",'[1]Sort Sheet'!E39)","v":"322A"},{"$f":"IF('[1]Sort Sheet'!F39=0,\"\",'[1]Sort Sheet'!F39)","v":"M"},{"$f":"IF('[1]Sort Sheet'!E39=0,\"\",'[1]Sort Sheet'!AT39)","v":"Y"},{"$f":"IF('[1]Sort Sheet'!E39=0,\"\",'[1]Sort Sheet'!H39)","v":"Y"},{"$f":"IF('[1]Sort Sheet'!E39=0,\"\",'[1]Sort Sheet'!J39)","v":"Rich Enterprises P/L"},{"$f":"IF('[1]Sort Sheet'!E39=0,\"\",'[1]Sort Sheet'!L39)","v":"Angus / Charolais X"},{"$f":"IF('[1]Sort Sheet'!E39=0,\"\",'[1]Sort Sheet'!O39)","v":0},{"$f":"IF('[1]Sort Sheet'!P39=0,\"\",'[1]Sort Sheet'!P39)","v":299.8},{"$f":"IF('[1]Sort Sheet'!E39=0,\"\",'[1]Sort Sheet'!Q39)","v":10},{"$f":"IF('[1]Sort Sheet'!E39=0,\"\",'[1]Sort Sheet'!R39)","v":3},{"$f":"IF('[1]Sort Sheet'!E39=0,\"\",'[1]Sort Sheet'!S39)","v":80},{"$f":"IF('[1]Sort Sheet'!E39=0,\"\",'[1]Sort Sheet'!U39)","v":"1b"},{"$f":"IF('[1]Sort Sheet'!E39=0,\"\",'[1]Sort Sheet'!V39)","v":1},{"$f":"IF('[1]Sort Sheet'!E39=0,\"\",'[1]Sort Sheet'!W39)","v":1},{"$f":"IF('[1]Sort Sheet'!E39=0,\"\",'[1]Sort Sheet'!X39)","v":5.49},{"$f":"IF('[1]Sort Sheet'!E39=0,\"\",'[1]Sort Sheet'!M39)","v":54.51},{"$f":"IF('[1]Sort Sheet'!E39=0,\"\",'[1]Sort Sheet'!Z39)","v":59.74},{"$f":"IF('[1]Sort Sheet'!E39=0,\"\",'[1]Sort Sheet'!AA39)","v":10.756676557863502},{"$f":"IF('[1]Sort Sheet'!E39=0,\"\",'[1]Sort Sheet'!AB39)","v":1926.5263649851631},{"$f":"IF('[1]Sort Sheet'!E39=0,\"\",'[1]Sort Sheet'!AC39)","v":6.426038575667655},192.65,2119.1763649851632,7.0686336390432389]
[36,{"$f":"IF('[1]Sort Sheet'!D40=0,\"\",'[1]Sort Sheet'!D40)","v":290},{"$f":"IF('[1]Sort Sheet'!E40=0,\"\",'[1]Sort Sheet'!E40)","v":"351A"},{"$f":"IF('[1]Sort Sheet'!F40=0,\"\",'[1]Sort Sheet'!F40)","v":"M"},{"$f":"IF('[1]Sort Sheet'!E40=0,\"\",'[1]Sort Sheet'!AT40)","v":"Y"},{"$f":"IF('[1]Sort Sheet'!E40=0,\"\",'[1]Sort Sheet'!H40)","v":"Y"},{"$f":"IF('[1]Sort Sheet'!E40=0,\"\",'[1]Sort Sheet'!J40)","v":"B Feeders Pty ltd"},{"$f":"IF('[1]Sort Sheet'!E40=0,\"\",'[1]Sort Sheet'!L40)","v":"Charolais X Santa"},{"$f":"IF('[1]Sort Sheet'!E40=0,\"\",'[1]Sort Sheet'!O40)","v":0},{"$f":"IF('[1]Sort Sheet'!P40=0,\"\",'[1]Sort Sheet'!P40)","v":293.60000000000002},{"$f":"IF('[1]Sort Sheet'!E40=0,\"\",'[1]Sort Sheet'!Q40)","v":15},{"$f":"IF('[1]Sort Sheet'!E40=0,\"\",'[1]Sort Sheet'!R40)","v":4},{"$f":"IF('[1]Sort Sheet'!E40=0,\"\",'[1]Sort Sheet'!S40)","v":80},{"$f":"IF('[1]Sort Sheet'!E40=0,\"\",'[1]Sort Sheet'!U40)","v":"2"},{"$f":"IF('[1]Sort Sheet'!E40=0,\"\",'[1]Sort Sheet'!V40)","v":1},{"$f":"IF('[1]Sort Sheet'!E40=0,\"\",'[1]Sort Sheet'!W40)","v":1},{"$f":"IF('[1]Sort Sheet'!E40=0,\"\",'[1]Sort Sheet'!X40)","v":5.57},{"$f":"IF('[1]Sort Sheet'!E40=0,\"\",'[1]Sort Sheet'!M40)","v":52.04},{"$f":"IF('[1]Sort Sheet'!E40=0,\"\",'[1]Sort Sheet'!Z40)","v":59.71},{"$f":"IF('[1]Sort Sheet'!E40=0,\"\",'[1]Sort Sheet'!AA40)","v":10.756676557863502},{"$f":"IF('[1]Sort Sheet'!E40=0,\"\",'[1]Sort Sheet'!AB40)","v":1885.7374777448076},{"$f":"IF('[1]Sort Sheet'!E40=0,\"\",'[1]Sort Sheet'!AC40)","v":6.4228115727002981},188.57,2074.3074777448078,7.0650799650708702]
[37,{"$f":"IF('[1]Sort Sheet'!D41=0,\"\",'[1]Sort Sheet'!D41)","v":263},{"$f":"IF('[1]Sort Sheet'!E41=0,\"\",'[1]Sort Sheet'!E41)","v":"341A"},{"$f":"IF('[1]Sort Sheet'!F41=0,\"\",'[1]Sort Sheet'!F41)","v":"M"},{"$f":"IF('[1]Sort Sheet'!E41=0,\"\",'[1]Sort Sheet'!AT41)","v":"Y"},{"$f":"IF('[1]Sort Sheet'!E41=0,\"\",'[1]Sort Sheet'!H41)","v":"Y"},{"$f":"IF('[1]Sort Sheet'!E41=0,\"\",'[1]Sort Sheet'!J41)","v":"Smithfield Cattle Co"},{"$f":"IF('[1]Sort Sheet'!E41=0,\"\",'[1]Sort Sheet'!L41)","v":"Santa X Angus "},{"$f":"IF('[1]Sort Sheet'!E41=0,\"\",'[1]Sort Sheet'!O41)","v":0},{"$f":"IF('[1]Sort Sheet'!P41=0,\"\",'[1]Sort Sheet'!P41)","v":291.2},{"$f":"IF('[1]Sort Sheet'!E41=0,\"\",'[1]Sort Sheet'!Q41)","v":11},{"$f":"IF('[1]Sort Sheet'!E41=0,\"\",'[1]Sort Sheet'!R41)","v":5},{"$f":"IF('[1]Sort Sheet'!E41=0,\"\",'[1]Sort Sheet'!S41)","v":83},{"$f":"IF('[1]Sort Sheet'!E41=0,\"\",'[1]Sort Sheet'!U41)","v":"3"},{"$f":"IF('[1]Sort Sheet'!E41=0,\"\",'[1]Sort Sheet'!V41)","v":2},{"$f":"IF('[1]Sort Sheet'!E41=0,\"\",'[1]Sort Sheet'!W41)","v":1},{"$f":"IF('[1]Sort Sheet'!E41=0,\"\",'[1]Sort Sheet'!X41)","v":5.7},{"$f":"IF('[1]Sort Sheet'!E41=0,\"\",'[1]Sort Sheet'!M41)","v":54.7},{"$f":"IF('[1]Sort Sheet'!E41=0,\"\",'[1]Sort Sheet'!Z41)","v":59.69},{"$f":"IF('[1]Sort Sheet'!E41=0,\"\",'[1]Sort Sheet'!AA41)","v":10.756676557863502},{"$f":"IF('[1]Sort Sheet'!E41=0,\"\",'[1]Sort Sheet'!AB41)","v":1869.6962611275965},{"$f":"IF('[1]Sort Sheet'!E41=0,\"\",'[1]Sort Sheet'!AC41)","v":6.4206602373887245},186.97,2056.6662611275965,7.0627275450810325]
[38,{"$f":"IF('[1]Sort Sheet'!D42=0,\"\",'[1]Sort Sheet'!D42)","v":293},{"$f":"IF('[1]Sort Sheet'!E42=0,\"\",'[1]Sort Sheet'!E42)","v":"350A"},{"$f":"IF('[1]Sort Sheet'!F42=0,\"\",'[1]Sort Sheet'!F42)","v":"M"},{"$f":"IF('[1]Sort Sheet'!E42=0,\"\",'[1]Sort Sheet'!AT42)","v":"Y"},{"$f":"IF('[1]Sort Sheet'!E42=0,\"\",'[1]Sort Sheet'!H42)","v":"Y"},{"$f":"IF('[1]Sort Sheet'!E42=0,\"\",'[1]Sort Sheet'!J42)","v":"B Feeders Pty ltd"},{"$f":"IF('[1]Sort Sheet'!E42=0,\"\",'[1]Sort Sheet'!L42)","v":"Santa"},{"$f":"IF('[1]Sort Sheet'!E42=0,\"\",'[1]Sort Sheet'!O42)","v":0},{"$f":"IF('[1]Sort Sheet'!P42=0,\"\",'[1]Sort Sheet'!P42)","v":293.2},{"$f":"IF('[1]Sort Sheet'!E42=0,\"\",'[1]Sort Sheet'!Q42)","v":8},{"$f":"IF('[1]Sort Sheet'!E42=0,\"\",'[1]Sort Sheet'!R42)","v":5},{"$f":"IF('[1]Sort Sheet'!E42=0,\"\",'[1]Sort Sheet'!S42)","v":83},{"$f":"IF('[1]Sort Sheet'!E42=0,\"\",'[1]Sort Sheet'!U42)","v":"3"},{"$f":"IF('[1]Sort Sheet'!E42=0,\"\",'[1]Sort Sheet'!V42)","v":1},{"$f":"IF('[1]Sort Sheet'!E42=0,\"\",'[1]Sort Sheet'!W42)","v":0},{"$f":"IF('[1]Sort Sheet'!E42=0,\"\",'[1]Sort Sheet'!X42)","v":5.61},{"$f":"IF('[1]Sort Sheet'!E42=0,\"\",'[1]Sort Sheet'!M42)","v":52.88},{"$f":"IF('[1]Sort Sheet'!E42=0,\"\",'[1]Sort Sheet'!Z42)","v":59.65},{"$f":"IF('[1]Sort Sheet'!E42=0,\"\",'[1]Sort Sheet'!AA42)","v":10.756676557863502},{"$f":"IF('[1]Sort Sheet'!E42=0,\"\",'[1]Sort Sheet'!AB42)","v":1881.2760385756674},{"$f":"IF('[1]Sort Sheet'!E42=0,\"\",'[1]Sort Sheet'!AC42)","v":6.4163575667655781},188.13,2069.4060385756675,7.0580014958242412]
[39,{"$f":"IF('[1]Sort Sheet'!D43=0,\"\",'[1]Sort Sheet'!D43)","v":199},{"$f":"IF('[1]Sort Sheet'!E43=0,\"\",'[1]Sort Sheet'!E43)","v":"320A"},{"$f":"IF('[1]Sort Sheet'!F43=0,\"\",'[1]Sort Sheet'!F43)","v":"M"},{"$f":"IF('[1]Sort Sheet'!E43=0,\"\",'[1]Sort Sheet'!AT43)","v":"Y"},{"$f":"IF('[1]Sort Sheet'!E43=0,\"\",'[1]Sort Sheet'!H43)","v":"Y"},{"$f":"IF('[1]Sort Sheet'!E43=0,\"\",'[1]Sort Sheet'!J43)","v":"Darr Creek Pastoral"},{"$f":"IF('[1]Sort Sheet'!E43=0,\"\",'[1]Sort Sheet'!L43)","v":"Angus/Hereford X Limousin"},{"$f":"IF('[1]Sort Sheet'!E43=0,\"\",'[1]Sort Sheet'!O43)","v":0},{"$f":"IF('[1]Sort Sheet'!P43=0,\"\",'[1]Sort Sheet'!P43)","v":265.2},{"$f":"IF('[1]Sort Sheet'!E43=0,\"\",'[1]Sort Sheet'!Q43)","v":11},{"$f":"IF('[1]Sort Sheet'!E43=0,\"\",'[1]Sort Sheet'!R43)","v":5},{"$f":"IF('[1]Sort Sheet'!E43=0,\"\",'[1]Sort Sheet'!S43)","v":75},{"$f":"IF('[1]Sort Sheet'!E43=0,\"\",'[1]Sort Sheet'!U43)","v":"2"},{"$f":"IF('[1]Sort Sheet'!E43=0,\"\",'[1]Sort Sheet'!V43)","v":1},{"$f":"IF('[1]Sort Sheet'!E43=0,\"\",'[1]Sort Sheet'!W43)","v":1},{"$f":"IF('[1]Sort Sheet'!E43=0,\"\",'[1]Sort Sheet'!X43)","v":5.59},{"$f":"IF('[1]Sort Sheet'!E43=0,\"\",'[1]Sort Sheet'!M43)","v":55.67},{"$f":"IF('[1]Sort Sheet'!E43=0,\"\",'[1]Sort Sheet'!Z43)","v":59.56},{"$f":"IF('[1]Sort Sheet'!E43=0,\"\",'[1]Sort Sheet'!AA43)","v":10.756676557863502},{"$f":"IF('[1]Sort Sheet'!E43=0,\"\",'[1]Sort Sheet'!AB43)","v":1699.0506231454006},{"$f":"IF('[1]Sort Sheet'!E43=0,\"\",'[1]Sort Sheet'!AC43)","v":6.4066765578635012},169.91,1868.9606231454006,7.047362832373306]
[40,{"$f":"IF('[1]Sort Sheet'!D44=0,\"\",'[1]Sort Sheet'!D44)","v":225},{"$f":"IF('[1]Sort Sheet'!E44=0,\"\",'[1]Sort Sheet'!E44)","v":"326A"},{"$f":"IF('[1]Sort Sheet'!F44=0,\"\",'[1]Sort Sheet'!F44)","v":"F"},{"$f":"IF('[1]Sort Sheet'!E44=0,\"\",'[1]Sort Sheet'!AT44)","v":"Y"},{"$f":"IF('[1]Sort Sheet'!E44=0,\"\",'[1]Sort Sheet'!H44)","v":"Y"},{"$f":"IF('[1]Sort Sheet'!E44=0,\"\",'[1]Sort Sheet'!J44)","v":"R S & K M  Stevens Family Trust "},{"$f":"IF('[1]Sort Sheet'!E44=0,\"\",'[1]Sort Sheet'!L44)","v":"Charolais X Santa"},{"$f":"IF('[1]Sort Sheet'!E44=0,\"\",'[1]Sort Sheet'!O44)","v":0},{"$f":"IF('[1]Sort Sheet'!P44=0,\"\",'[1]Sort Sheet'!P44)","v":251.4},{"$f":"IF('[1]Sort Sheet'!E44=0,\"\",'[1]Sort Sheet'!Q44)","v":10},{"$f":"IF('[1]Sort Sheet'!E44=0,\"\",'[1]Sort Sheet'!R44)","v":4},{"$f":"IF('[1]Sort Sheet'!E44=0,\"\",'[1]Sort Sheet'!S44)","v":84},{"$f":"IF('[1]Sort Sheet'!E44=0,\"\",'[1]Sort Sheet'!U44)","v":"1b"},{"$f":"IF('[1]Sort Sheet'!E44=0,\"\",'[1]Sort Sheet'!V44)","v":1},{"$f":"IF('[1]Sort Sheet'!E44=0,\"\",'[1]Sort Sheet'!W44)","v":1},{"$f":"IF('[1]Sort Sheet'!E44=0,\"\",'[1]Sort Sheet'!X44)","v":5.49},{"$f":"IF('[1]Sort Sheet'!E44=0,\"\",'[1]Sort Sheet'!M44)","v":53.81},{"$f":"IF('[1]Sort Sheet'!E44=0,\"\",'[1]Sort Sheet'!Z44)","v":59.56},{"$f":"IF('[1]Sort Sheet'!E44=0,\"\",'[1]Sort Sheet'!AA44)","v":10.756676557863502},{"$f":"IF('[1]Sort Sheet'!E44=0,\"\",'[1]Sort Sheet'!AB44)","v":1610.6384866468843},{"$f":"IF('[1]Sort Sheet'!E44=0,\"\",'[1]Sort Sheet'!AC44)","v":6.4066765578635012},161.06,1771.6984866468842,7.0473289047210983]
[41,{"$f":"IF('[1]Sort Sheet'!D45=0,\"\",'[1]Sort Sheet'!D45)","v":233},{"$f":"IF('[1]Sort Sheet'!E45=0,\"\",'[1]Sort Sheet'!E45)","v":"329B"},{"$f":"IF('[1]Sort Sheet'!F45=0,\"\",'[1]Sort Sheet'!F45)","v":"F"},{"$f":"IF('[1]Sort Sheet'!E45=0,\"\",'[1]Sort Sheet'!AT45)","v":"Y"},{"$f":"IF('[1]Sort Sheet'!E45=0,\"\",'[1]Sort Sheet'!H45)","v":"Y"},{"$f":"IF('[1]Sort Sheet'!E45=0,\"\",'[1]Sort Sheet'!J45)","v":"Juandah Grazing"},{"$f":"IF('[1]Sort Sheet'!E45=0,\"\",'[1]Sort Sheet'!L45)","v":"Charolais X Droughtmaster"},{"$f":"IF('[1]Sort Sheet'!E45=0,\"\",'[1]Sort Sheet'!O45)","v":0},{"$f":"IF('[1]Sort Sheet'!P45=0,\"\",'[1]Sort Sheet'!P45)","v":255.4},{"$f":"IF('[1]Sort Sheet'!E45=0,\"\",'[1]Sort Sheet'!Q45)","v":10},{"$f":"IF('[1]Sort Sheet'!E45=0,\"\",'[1]Sort Sheet'!R45)","v":5},{"$f":"IF('[1]Sort Sheet'!E45=0,\"\",'[1]Sort Sheet'!S45)","v":88},{"$f":"IF('[1]Sort Sheet'!E45=0,\"\",'[1]Sort Sheet'!U45)","v":"2"},{"$f":"IF('[1]Sort Sheet'!E45=0,\"\",'[1]Sort Sheet'!V45)","v":2},{"$f":"IF('[1]Sort Sheet'!E45=0,\"\",'[1]Sort Sheet'!W45)","v":1},{"$f":"IF('[1]Sort Sheet'!E45=0,\"\",'[1]Sort Sheet'!X45)","v":5.5},{"$f":"IF('[1]Sort Sheet'!E45=0,\"\",'[1]Sort Sheet'!M45)","v":55.43},{"$f":"IF('[1]Sort Sheet'!E45=0,\"\",'[1]Sort Sheet'!Z45)","v":59.55},{"$f":"IF('[1]Sort Sheet'!E45=0,\"\",'[1]Sort Sheet'!AA45)","v":10.756676557863502},{"$f":"IF('[1]Sort Sheet'!E45=0,\"\",'[1]Sort Sheet'!AB45)","v":1635.9904673590506},{"$f":"IF('[1]Sort Sheet'!E45=0,\"\",'[1]Sort Sheet'!AC45)","v":6.4056008902077153},163.6,1799.5904673590505,7.0461647116642538]
[42,{"$f":"IF('[1]Sort Sheet'!D46=0,\"\",'[1]Sort Sheet'!D46)","v":291},{"$f":"IF('[1]Sort Sheet'!E46=0,\"\",'[1]Sort Sheet'!E46)","v":"349A"},{"$f":"IF('[1]Sort Sheet'!F46=0,\"\",'[1]Sort Sheet'!F46)","v":"M"},{"$f":"IF('[1]Sort Sheet'!E46=0,\"\",'[1]Sort Sheet'!AT46)","v":"Y"},{"$f":"IF('[1]Sort Sheet'!E46=0,\"\",'[1]Sort Sheet'!H46)","v":"Y"},{"$f":"IF('[1]Sort Sheet'!E46=0,\"\",'[1]Sort Sheet'!J46)","v":"B Feeders Pty ltd"},{"$f":"IF('[1]Sort Sheet'!E46=0,\"\",'[1]Sort Sheet'!L46)","v":"Charolais X Santa"},{"$f":"IF('[1]Sort Sheet'!E46=0,\"\",'[1]Sort Sheet'!O46)","v":0},{"$f":"IF('[1]Sort Sheet'!P46=0,\"\",'[1]Sort Sheet'!P46)","v":307.39999999999998},{"$f":"IF('[1]Sort Sheet'!E46=0,\"\",'[1]Sort Sheet'!Q46)","v":10},{"$f":"IF('[1]Sort Sheet'!E46=0,\"\",'[1]Sort Sheet'!R46)","v":3},{"$f":"IF('[1]Sort Sheet'!E46=0,\"\",'[1]Sort Sheet'!S46)","v":80},{"$f":"IF('[1]Sort Sheet'!E46=0,\"\",'[1]Sort Sheet'!U46)","v":"2"},{"$f":"IF('[1]Sort Sheet'!E46=0,\"\",'[1]Sort Sheet'!V46)","v":1},{"$f":"IF('[1]Sort Sheet'!E46=0,\"\",'[1]Sort Sheet'!W46)","v":1},{"$f":"IF('[1]Sort Sheet'!E46=0,\"\",'[1]Sort Sheet'!X46)","v":5.52},{"$f":"IF('[1]Sort Sheet'!E46=0,\"\",'[1]Sort Sheet'!M46)","v":54.33},{"$f":"IF('[1]Sort Sheet'!E46=0,\"\",'[1]Sort Sheet'!Z46)","v":59.35},{"$f":"IF('[1]Sort Sheet'!E46=0,\"\",'[1]Sort Sheet'!AA46)","v":10.756676557863502},{"$f":"IF('[1]Sort Sheet'!E46=0,\"\",'[1]Sort Sheet'!AB46)","v":1962.4685089020772},{"$f":"IF('[1]Sort Sheet'!E46=0,\"\",'[1]Sort Sheet'!AC46)","v":6.3840875370919887},196.25,2158.7185089020772,7.0225065351401348]
[43,{"$f":"IF('[1]Sort Sheet'!D47=0,\"\",'[1]Sort Sheet'!D47)","v":221},{"$f":"IF('[1]Sort Sheet'!E47=0,\"\",'[1]Sort Sheet'!E47)","v":"324B"},{"$f":"IF('[1]Sort Sheet'!F47=0,\"\",'[1]Sort Sheet'!F47)","v":"F"},{"$f":"IF('[1]Sort Sheet'!E47=0,\"\",'[1]Sort Sheet'!AT47)","v":"Y"},{"$f":"IF('[1]Sort Sheet'!E47=0,\"\",'[1]Sort Sheet'!H47)","v":"Y"},{"$f":"IF('[1]Sort Sheet'!E47=0,\"\",'[1]Sort Sheet'!J47)","v":"R S & K M  Stevens Family Trust "},{"$f":"IF('[1]Sort Sheet'!E47=0,\"\",'[1]Sort Sheet'!L47)","v":"Charolais X Santa"},{"$f":"IF('[1]Sort Sheet'!E47=0,\"\",'[1]Sort Sheet'!O47)","v":0},{"$f":"IF('[1]Sort Sheet'!P47=0,\"\",'[1]Sort Sheet'!P47)","v":264.60000000000002},{"$f":"IF('[1]Sort Sheet'!E47=0,\"\",'[1]Sort Sheet'!Q47)","v":10},{"$f":"IF('[1]Sort Sheet'!E47=0,\"\",'[1]Sort Sheet'!R47)","v":7},{"$f":"IF('[1]Sort Sheet'!E47=0,\"\",'[1]Sort Sheet'!S47)","v":96},{"$f":"IF('[1]Sort Sheet'!E47=0,\"\",'[1]Sort Sheet'!U47)","v":"1b"},{"$f":"IF('[1]Sort Sheet'!E47=0,\"\",'[1]Sort Sheet'!V47)","v":1},{"$f":"IF('[1]Sort Sheet'!E47=0,\"\",'[1]Sort Sheet'!W47)","v":0},{"$f":"IF('[1]Sort Sheet'!E47=0,\"\",'[1]Sort Sheet'!X47)","v":5.38},{"$f":"IF('[1]Sort Sheet'!E47=0,\"\",'[1]Sort Sheet'!M47)","v":54.88},{"$f":"IF('[1]Sort Sheet'!E47=0,\"\",'[1]Sort Sheet'!Z47)","v":59.31},{"$f":"IF('[1]Sort Sheet'!E47=0,\"\",'[1]Sort Sheet'!AA47)","v":10.756676557863502},{"$f":"IF('[1]Sort Sheet'!E47=0,\"\",'[1]Sort Sheet'!AB47)","v":1688.091075667656},{"$f":"IF('[1]Sort Sheet'!E47=0,\"\",'[1]Sort Sheet'!AC47)","v":6.3797848664688432},168.81,1856.901075667656,7.017766725879274]
[44,{"$f":"IF('[1]Sort Sheet'!D48=0,\"\",'[1]Sort Sheet'!D48)","v":266},{"$f":"IF('[1]Sort Sheet'!E48=0,\"\",'[1]Sort Sheet'!E48)","v":"341B"},{"$f":"IF('[1]Sort Sheet'!F48=0,\"\",'[1]Sort Sheet'!F48)","v":"M"},{"$f":"IF('[1]Sort Sheet'!E48=0,\"\",'[1]Sort Sheet'!AT48)","v":"Y"},{"$f":"IF('[1]Sort Sheet'!E48=0,\"\",'[1]Sort Sheet'!H48)","v":"Y"},{"$f":"IF('[1]Sort Sheet'!E48=0,\"\",'[1]Sort Sheet'!J48)","v":"Smithfield Cattle Co"},{"$f":"IF('[1]Sort Sheet'!E48=0,\"\",'[1]Sort Sheet'!L48)","v":"Santa X Angus "},{"$f":"IF('[1]Sort Sheet'!E48=0,\"\",'[1]Sort Sheet'!O48)","v":0},{"$f":"IF('[1]Sort Sheet'!P48=0,\"\",'[1]Sort Sheet'!P48)","v":300},{"$f":"IF('[1]Sort Sheet'!E48=0,\"\",'[1]Sort Sheet'!Q48)","v":12},{"$f":"IF('[1]Sort Sheet'!E48=0,\"\",'[1]Sort Sheet'!R48)","v":3},{"$f":"IF('[1]Sort Sheet'!E48=0,\"\",'[1]Sort Sheet'!S48)","v":77},{"$f":"IF('[1]Sort Sheet'!E48=0,\"\",'[1]Sort Sheet'!U48)","v":"1b"},{"$f":"IF('[1]Sort Sheet'!E48=0,\"\",'[1]Sort Sheet'!V48)","v":1},{"$f":"IF('[1]Sort Sheet'!E48=0,\"\",'[1]Sort Sheet'!W48)","v":1},{"$f":"IF('[1]Sort Sheet'!E48=0,\"\",'[1]Sort Sheet'!X48)","v":5.47},{"$f":"IF('[1]Sort Sheet'!E48=0,\"\",'[1]Sort Sheet'!M48)","v":55.96},{"$f":"IF('[1]Sort Sheet'!E48=0,\"\",'[1]Sort Sheet'!Z48)","v":59.3},{"$f":"IF('[1]Sort Sheet'!E48=0,\"\",'[1]Sort Sheet'!AA48)","v":10.756676557863502},{"$f":"IF('[1]Sort Sheet'!E48=0,\"\",'[1]Sort Sheet'!AB48)","v":1913.6127596439171},{"$f":"IF('[1]Sort Sheet'!E48=0,\"\",'[1]Sort Sheet'!AC48)","v":6.3787091988130573},191.36,2104.972759643917,7.016575865479723]
[45,{"$f":"IF('[1]Sort Sheet'!D49=0,\"\",'[1]Sort Sheet'!D49)","v":292},{"$f":"IF('[1]Sort Sheet'!E49=0,\"\",'[1]Sort Sheet'!E49)","v":"350C"},{"$f":"IF('[1]Sort Sheet'!F49=0,\"\",'[1]Sort Sheet'!F49)","v":"M"},{"$f":"IF('[1]Sort Sheet'!E49=0,\"\",'[1]Sort Sheet'!AT49)","v":"Y"},{"$f":"IF('[1]Sort Sheet'!E49=0,\"\",'[1]Sort Sheet'!H49)","v":"Y"},{"$f":"IF('[1]Sort Sheet'!E49=0,\"\",'[1]Sort Sheet'!J49)","v":"B Feeders Pty ltd"},{"$f":"IF('[1]Sort Sheet'!E49=0,\"\",'[1]Sort Sheet'!L49)","v":"Santa"},{"$f":"IF('[1]Sort Sheet'!E49=0,\"\",'[1]Sort Sheet'!O49)","v":0},{"$f":"IF('[1]Sort Sheet'!P49=0,\"\",'[1]Sort Sheet'!P49)","v":301.8},{"$f":"IF('[1]Sort Sheet'!E49=0,\"\",'[1]Sort Sheet'!Q49)","v":12},{"$f":"IF('[1]Sort Sheet'!E49=0,\"\",'[1]Sort Sheet'!R49)","v":3},{"$f":"IF('[1]Sort Sheet'!E49=0,\"\",'[1]Sort Sheet'!S49)","v":76},{"$f":"IF('[1]Sort Sheet'!E49=0,\"\",'[1]Sort Sheet'!U49)","v":"2"},{"$f":"IF('[1]Sort Sheet'!E49=0,\"\",'[1]Sort Sheet'!V49)","v":1},{"$f":"IF('[1]Sort Sheet'!E49=0,\"\",'[1]Sort Sheet'!W49)","v":1},{"$f":"IF('[1]Sort Sheet'!E49=0,\"\",'[1]Sort Sheet'!X49)","v":5.59},{"$f":"IF('[1]Sort Sheet'!E49=0,\"\",'[1]Sort Sheet'!M49)","v":52.94},{"$f":"IF('[1]Sort Sheet'!E49=0,\"\",'[1]Sort Sheet'!Z49)","v":59.16},{"$f":"IF('[1]Sort Sheet'!E49=0,\"\",'[1]Sort Sheet'!AA49)","v":10.756676557863502},{"$f":"IF('[1]Sort Sheet'!E49=0,\"\",'[1]Sort Sheet'!AB49)","v":1920.5495252225521},{"$f":"IF('[1]Sort Sheet'!E49=0,\"\",'[1]Sort Sheet'!AC49)","v":6.3636498516320481},192.05,2112.5995252225521,6.999998426847422]
[46,{"$f":"IF('[1]Sort Sheet'!D50=0,\"\",'[1]Sort Sheet'!D50)","v":217},{"$f":"IF('[1]Sort Sheet'!E50=0,\"\",'[1]Sort Sheet'!E50)","v":"326C"},{"$f":"IF('[1]Sort Sheet'!F50=0,\"\",'[1]Sort Sheet'!F50)","v":"F"},{"$f":"IF('[1]Sort Sheet'!E50=0,\"\",'[1]Sort Sheet'!AT50)","v":"Y"},{"$f":"IF('[1]Sort Sheet'!E50=0,\"\",'[1]Sort Sheet'!H50)","v":"Y"},{"$f":"IF('[1]Sort Sheet'!E50=0,\"\",'[1]Sort Sheet'!J50)","v":"R S & K M  Stevens Family Trust "},{"$f":"IF('[1]Sort Sheet'!E50=0,\"\",'[1]Sort Sheet'!L50)","v":"Charolais X Angus/Hereford"},{"$f":"IF('[1]Sort Sheet'!E50=0,\"\",'[1]Sort Sheet'!O50)","v":0},{"$f":"IF('[1]Sort Sheet'!P50=0,\"\",'[1]Sort Sheet'!P50)","v":246.4},{"$f":"IF('[1]Sort Sheet'!E50=0,\"\",'[1]Sort Sheet'!Q50)","v":11},{"$f":"IF('[1]Sort Sheet'!E50=0,\"\",'[1]Sort Sheet'!R50)","v":5},{"$f":"IF('[1]Sort Sheet'!E50=0,\"\",'[1]Sort Sheet'!S50)","v":83},{"$f":"IF('[1]Sort Sheet'!E50=0,\"\",'[1]Sort Sheet'!U50)","v":"1b"},{"$f":"IF('[1]Sort Sheet'!E50=0,\"\",'[1]Sort Sheet'!V50)","v":2},{"$f":"IF('[1]Sort Sheet'!E50=0,\"\",'[1]Sort Sheet'!W50)","v":1},{"$f":"IF('[1]Sort Sheet'!E50=0,\"\",'[1]Sort Sheet'!X50)","v":5.59},{"$f":"IF('[1]Sort Sheet'!E50=0,\"\",'[1]Sort Sheet'!M50)","v":55.54},{"$f":"IF('[1]Sort Sheet'!E50=0,\"\",'[1]Sort Sheet'!Z50)","v":59.14},{"$f":"IF('[1]Sort Sheet'!E50=0,\"\",'[1]Sort Sheet'!AA50)","v":10.756676557863502},{"$f":"IF('[1]Sort Sheet'!E50=0,\"\",'[1]Sort Sheet'!AB50)","v":1567.4732344213653},{"$f":"IF('[1]Sort Sheet'!E50=0,\"\",'[1]Sort Sheet'!AC50)","v":6.3614985163204762},156.75,1724.2232344213653,6.9976592306061898]
[47,{"$f":"IF('[1]Sort Sheet'!D51=0,\"\",'[1]Sort Sheet'!D51)","v":245},{"$f":"IF('[1]Sort Sheet'!E51=0,\"\",'[1]Sort Sheet'!E51)","v":"334B"},{"$f":"IF('[1]Sort Sheet'!F51=0,\"\",'[1]Sort Sheet'!F51)","v":"F"},{"$f":"IF('[1]Sort Sheet'!E51=0,\"\",'[1]Sort Sheet'!AT51)","v":"Y"},{"$f":"IF('[1]Sort Sheet'!E51=0,\"\",'[1]Sort Sheet'!H51)","v":"Y"},{"$f":"IF('[1]Sort Sheet'!E51=0,\"\",'[1]Sort Sheet'!J51)","v":"John & Estelle  Drynan"},{"$f":"IF('[1]Sort Sheet'!E51=0,\"\",'[1]Sort Sheet'!L51)","v":"Charolais "},{"$f":"IF('[1]Sort Sheet'!E51=0,\"\",'[1]Sort Sheet'!O51)","v":0},{"$f":"IF('[1]Sort Sheet'!P51=0,\"\",'[1]Sort Sheet'!P51)","v":268.8},{"$f":"IF('[1]Sort Sheet'!E51=0,\"\",'[1]Sort Sheet'!Q51)","v":10},{"$f":"IF('[1]Sort Sheet'!E51=0,\"\",'[1]Sort Sheet'!R51)","v":5},{"$f":"IF('[1]Sort Sheet'!E51=0,\"\",'[1]Sort Sheet'!S51)","v":90},{"$f":"IF('[1]Sort Sheet'!E51=0,\"\",'[1]Sort Sheet'!U51)","v":"2"},{"$f":"IF('[1]Sort Sheet'!E51=0,\"\",'[1]Sort Sheet'!V51)","v":1},{"$f":"IF('[1]Sort Sheet'!E51=0,\"\",'[1]Sort Sheet'!W51)","v":1},{"$f":"IF('[1]Sort Sheet'!E51=0,\"\",'[1]Sort Sheet'!X51)","v":5.53},{"$f":"IF('[1]Sort Sheet'!E51=0,\"\",'[1]Sort Sheet'!M51)","v":57.65},{"$f":"IF('[1]Sort Sheet'!E51=0,\"\",'[1]Sort Sheet'!Z51)","v":59.13},{"$f":"IF('[1]Sort Sheet'!E51=0,\"\",'[1]Sort Sheet'!AA51)","v":10.756676557863502},{"$f":"IF('[1]Sort Sheet'!E51=0,\"\",'[1]Sort Sheet'!AB51)","v":1709.6816617210684},{"$f":"IF('[1]Sort Sheet'!E51=0,\"\",'[1]Sort Sheet'!AC51)","v":6.3604228486646885},170.97,1880.6516617210684,6.9964719558075457]
[48,{"$f":"IF('[1]Sort Sheet'!D52=0,\"\",'[1]Sort Sheet'!D52)","v":224},{"$f":"IF('[1]Sort Sheet'!E52=0,\"\",'[1]Sort Sheet'!E52)","v":"325B"},{"$f":"IF('[1]Sort Sheet'!F52=0,\"\",'[1]Sort Sheet'!F52)","v":"F"},{"$f":"IF('[1]Sort Sheet'!E52=0,\"\",'[1]Sort Sheet'!AT52)","v":"Y"},{"$f":"IF('[1]Sort Sheet'!E52=0,\"\",'[1]Sort Sheet'!H52)","v":"Y"},{"$f":"IF('[1]Sort Sheet'!E52=0,\"\",'[1]Sort Sheet'!J52)","v":"R S & K M  Stevens Family Trust "},{"$f":"IF('[1]Sort Sheet'!E52=0,\"\",'[1]Sort Sheet'!L52)","v":"Charolais X Brangus"},{"$f":"IF('[1]Sort Sheet'!E52=0,\"\",'[1]Sort Sheet'!O52)","v":0},{"$f":"IF('[1]Sort Sheet'!P52=0,\"\",'[1]Sort Sheet'!P52)","v":257.2},{"$f":"IF('[1]Sort Sheet'!E52=0,\"\",'[1]Sort Sheet'!Q52)","v":10},{"$f":"IF('[1]Sort Sheet'!E52=0,\"\",'[1]Sort Sheet'!R52)","v":5},{"$f":"IF('[1]Sort Sheet'!E52=0,\"\",'[1]Sort Sheet'!S52)","v":85},{"$f":"IF('[1]Sort Sheet'!E52=0,\"\",'[1]Sort Sheet'!U52)","v":"1b"},{"$f":"IF('[1]Sort Sheet'!E52=0,\"\",'[1]Sort Sheet'!V52)","v":1},{"$f":"IF('[1]Sort Sheet'!E52=0,\"\",'[1]Sort Sheet'!W52)","v":1},{"$f":"IF('[1]Sort Sheet'!E52=0,\"\",'[1]Sort Sheet'!X52)","v":5.47},{"$f":"IF('[1]Sort Sheet'!E52=0,\"\",'[1]Sort Sheet'!M52)","v":56.09},{"$f":"IF('[1]Sort Sheet'!E52=0,\"\",'[1]Sort Sheet'!Z52)","v":59.04},{"$f":"IF('[1]Sort Sheet'!E52=0,\"\",'[1]Sort Sheet'!AA52)","v":10.756676557863502},{"$f":"IF('[1]Sort Sheet'!E52=0,\"\",'[1]Sort Sheet'!AB52)","v":1633.4108011869437},{"$f":"IF('[1]Sort Sheet'!E52=0,\"\",'[1]Sort Sheet'!AC52)","v":6.3507418397626116},163.34,1796.7508011869436,6.9858118242105123]
[49,{"$f":"IF('[1]Sort Sheet'!D53=0,\"\",'[1]Sort Sheet'!D53)","v":246},{"$f":"IF('[1]Sort Sheet'!E53=0,\"\",'[1]Sort Sheet'!E53)","v":"333B"},{"$f":"IF('[1]Sort Sheet'!F53=0,\"\",'[1]Sort Sheet'!F53)","v":"F"},{"$f":"IF('[1]Sort Sheet'!E53=0,\"\",'[1]Sort Sheet'!AT53)","v":"Y"},{"$f":"IF('[1]Sort Sheet'!E53=0,\"\",'[1]Sort Sheet'!H53)","v":"Y"},{"$f":"IF('[1]Sort Sheet'!E53=0,\"\",'[1]Sort Sheet'!J53)","v":"John & Estelle  Drynan"},{"$f":"IF('[1]Sort Sheet'!E53=0,\"\",'[1]Sort Sheet'!L53)","v":"Charolais "},{"$f":"IF('[1]Sort Sheet'!E53=0,\"\",'[1]Sort Sheet'!O53)","v":0},{"$f":"IF('[1]Sort Sheet'!P53=0,\"\",'[1]Sort Sheet'!P53)","v":294.39999999999998},{"$f":"IF('[1]Sort Sheet'!E53=0,\"\",'[1]Sort Sheet'!Q53)","v":6},{"$f":"IF('[1]Sort Sheet'!E53=0,\"\",'[1]Sort Sheet'!R53)","v":4},{"$f":"IF('[1]Sort Sheet'!E53=0,\"\",'[1]Sort Sheet'!S53)","v":92},{"$f":"IF('[1]Sort Sheet'!E53=0,\"\",'[1]Sort Sheet'!U53)","v":"1b"},{"$f":"IF('[1]Sort Sheet'!E53=0,\"\",'[1]Sort Sheet'!V53)","v":1},{"$f":"IF('[1]Sort Sheet'!E53=0,\"\",'[1]Sort Sheet'!W53)","v":1},{"$f":"IF('[1]Sort Sheet'!E53=0,\"\",'[1]Sort Sheet'!X53)","v":5.54},{"$f":"IF('[1]Sort Sheet'!E53=0,\"\",'[1]Sort Sheet'!M53)","v":61.2},{"$f":"IF('[1]Sort Sheet'!E53=0,\"\",'[1]Sort Sheet'!Z53)","v":58.88},{"$f":"IF('[1]Sort Sheet'!E53=0,\"\",'[1]Sort Sheet'!AA53)","v":10.756676557863502},{"$f":"IF('[1]Sort Sheet'!E53=0,\"\",'[1]Sort Sheet'!AB53)","v":1864.5915727002969},{"$f":"IF('[1]Sort Sheet'!E53=0,\"\",'[1]Sort Sheet'!AC53)","v":6.3335311572700306},186.46,2051.0515727002967,6.9668871355308992]
[50,{"$f":"IF('[1]Sort Sheet'!D54=0,\"\",'[1]Sort Sheet'!D54)","v":270},{"$f":"IF('[1]Sort Sheet'!E54=0,\"\",'[1]Sort Sheet'!E54)","v":"342A"},{"$f":"IF('[1]Sort Sheet'!F54=0,\"\",'[1]Sort Sheet'!F54)","v":"M"},{"$f":"IF('[1]Sort Sheet'!E54=0,\"\",'[1]Sort Sheet'!AT54)","v":"Y"},{"$f":"IF('[1]Sort Sheet'!E54=0,\"\",'[1]Sort Sheet'!H54)","v":"Y"},{"$f":"IF('[1]Sort Sheet'!E54=0,\"\",'[1]Sort Sheet'!J54)","v":"Smithfield Cattle Co"},{"$f":"IF('[1]Sort Sheet'!E54=0,\"\",'[1]Sort Sheet'!L54)","v":"Angus X Hereford"},{"$f":"IF('[1]Sort Sheet'!E54=0,\"\",'[1]Sort Sheet'!O54)","v":0},{"$f":"IF('[1]Sort Sheet'!P54=0,\"\",'[1]Sort Sheet'!P54)","v":254.6},{"$f":"IF('[1]Sort Sheet'!E54=0,\"\",'[1]Sort Sheet'!Q54)","v":10},{"$f":"IF('[1]Sort Sheet'!E54=0,\"\",'[1]Sort Sheet'!R54)","v":7},{"$f":"IF('[1]Sort Sheet'!E54=0,\"\",'[1]Sort Sheet'!S54)","v":73},{"$f":"IF('[1]Sort Sheet'!E54=0,\"\",'[1]Sort Sheet'!U54)","v":"3"},{"$f":"IF('[1]Sort Sheet'!E54=0,\"\",'[1]Sort Sheet'!V54)","v":0},{"$f":"IF('[1]Sort Sheet'!E54=0,\"\",'[1]Sort Sheet'!W54)","v":1},{"$f":"IF('[1]Sort Sheet'!E54=0,\"\",'[1]Sort Sheet'!X54)","v":5.68},{"$f":"IF('[1]Sort Sheet'!E54=0,\"\",'[1]Sort Sheet'!M54)","v":56.45},{"$f":"IF('[1]Sort Sheet'!E54=0,\"\",'[1]Sort Sheet'!Z54)","v":58.85},{"$f":"IF('[1]Sort Sheet'!E54=0,\"\",'[1]Sort Sheet'!AA54)","v":10.756676557863502},{"$f":"IF('[1]Sort Sheet'!E54=0,\"\",'[1]Sort Sheet'!AB54)","v":1611.6954376854599},{"$f":"IF('[1]Sort Sheet'!E54=0,\"\",'[1]Sort Sheet'!AC54)","v":6.3303041543026701},161.16999999999999,1772.8654376854599,6.9633363616868031]
[51,{"$f":"IF('[1]Sort Sheet'!D55=0,\"\",'[1]Sort Sheet'!D55)","v":249},{"$f":"IF('[1]Sort Sheet'!E55=0,\"\",'[1]Sort Sheet'!E55)","v":"334A"},{"$f":"IF('[1]Sort Sheet'!F55=0,\"\",'[1]Sort Sheet'!F55)","v":"F"},{"$f":"IF('[1]Sort Sheet'!E55=0,\"\",'[1]Sort Sheet'!AT55)","v":"Y"},{"$f":"IF('[1]Sort Sheet'!E55=0,\"\",'[1]Sort Sheet'!H55)","v":"Y"},{"$f":"IF('[1]Sort Sheet'!E55=0,\"\",'[1]Sort Sheet'!J55)","v":"John & Estelle  Drynan"},{"$f":"IF('[1]Sort Sheet'!E55=0,\"\",'[1]Sort Sheet'!L55)","v":"Charolais "},{"$f":"IF('[1]Sort Sheet'!E55=0,\"\",'[1]Sort Sheet'!O55)","v":0},{"$f":"IF('[1]Sort Sheet'!P55=0,\"\",'[1]Sort Sheet'!P55)","v":253.6},{"$f":"IF('[1]Sort Sheet'!E55=0,\"\",'[1]Sort Sheet'!Q55)","v":6},{"$f":"IF('[1]Sort Sheet'!E55=0,\"\",'[1]Sort Sheet'!R55)","v":4},{"$f":"IF('[1]Sort Sheet'!E55=0,\"\",'[1]Sort Sheet'!S55)","v":81},{"$f":"IF('[1]Sort Sheet'!E55=0,\"\",'[1]Sort Sheet'!U55)","v":"1b"},{"$f":"IF('[1]Sort Sheet'!E55=0,\"\",'[1]Sort Sheet'!V55)","v":1},{"$f":"IF('[1]Sort Sheet'!E55=0,\"\",'[1]Sort Sheet'!W55)","v":1},{"$f":"IF('[1]Sort Sheet'!E55=0,\"\",'[1]Sort Sheet'!X55)","v":5.34},{"$f":"IF('[1]Sort Sheet'!E55=0,\"\",'[1]Sort Sheet'!M55)","v":61.17},{"$f":"IF('[1]Sort Sheet'!E55=0,\"\",'[1]Sort Sheet'!Z55)","v":58.82},{"$f":"IF('[1]Sort Sheet'!E55=0,\"\",'[1]Sort Sheet'!AA55)","v":10.756676557863502},{"$f":"IF('[1]Sort Sheet'!E55=0,\"\",'[1]Sort Sheet'!AB55)","v":1604.5467655786351},{"$f":"IF('[1]Sort Sheet'!E55=0,\"\",'[1]Sort Sheet'!AC55)","v":6.3270771513353123},160.44999999999999,1764.9967655786352,6.9597664257832621]
[52,{"$f":"IF('[1]Sort Sheet'!D56=0,\"\",'[1]Sort Sheet'!D56)","v":196},{"$f":"IF('[1]Sort Sheet'!E56=0,\"\",'[1]Sort Sheet'!E56)","v":"316C"},{"$f":"IF('[1]Sort Sheet'!F56=0,\"\",'[1]Sort Sheet'!F56)","v":"M"},{"$f":"IF('[1]Sort Sheet'!E56=0,\"\",'[1]Sort Sheet'!AT56)","v":"Y"},{"$f":"IF('[1]Sort Sheet'!E56=0,\"\",'[1]Sort Sheet'!H56)","v":"Y"},{"$f":"IF('[1]Sort Sheet'!E56=0,\"\",'[1]Sort Sheet'!J56)","v":"Riverglen Pastoral Company"},{"$f":"IF('[1]Sort Sheet'!E56=0,\"\",'[1]Sort Sheet'!L56)","v":"Charolais X"},{"$f":"IF('[1]Sort Sheet'!E56=0,\"\",'[1]Sort Sheet'!O56)","v":0},{"$f":"IF('[1]Sort Sheet'!P56=0,\"\",'[1]Sort Sheet'!P56)","v":285.60000000000002},{"$f":"IF('[1]Sort Sheet'!E56=0,\"\",'[1]Sort Sheet'!Q56)","v":12},{"$f":"IF('[1]Sort Sheet'!E56=0,\"\",'[1]Sort Sheet'!R56)","v":4},{"$f":"IF('[1]Sort Sheet'!E56=0,\"\",'[1]Sort Sheet'!S56)","v":73},{"$f":"IF('[1]Sort Sheet'!E56=0,\"\",'[1]Sort Sheet'!U56)","v":"2"},{"$f":"IF('[1]Sort Sheet'!E56=0,\"\",'[1]Sort Sheet'!V56)","v":1},{"$f":"IF('[1]Sort Sheet'!E56=0,\"\",'[1]Sort Sheet'!W56)","v":1},{"$f":"IF('[1]Sort Sheet'!E56=0,\"\",'[1]Sort Sheet'!X56)","v":5.52},{"$f":"IF('[1]Sort Sheet'!E56=0,\"\",'[1]Sort Sheet'!M56)","v":62.72},{"$f":"IF('[1]Sort Sheet'!E56=0,\"\",'[1]Sort Sheet'!Z56)","v":58.78},{"$f":"IF('[1]Sort Sheet'!E56=0,\"\",'[1]Sort Sheet'!AA56)","v":10.756676557863502},{"$f":"IF('[1]Sort Sheet'!E56=0,\"\",'[1]Sort Sheet'!AB56)","v":1805.7843916913951},{"$f":"IF('[1]Sort Sheet'!E56=0,\"\",'[1]Sort Sheet'!AC56)","v":6.3227744807121669},180.58,1986.364391691395,6.9550573938774329]
[53,{"$f":"IF('[1]Sort Sheet'!D57=0,\"\",'[1]Sort Sheet'!D57)","v":254},{"$f":"IF('[1]Sort Sheet'!E57=0,\"\",'[1]Sort Sheet'!E57)","v":"338A"},{"$f":"IF('[1]Sort Sheet'!F57=0,\"\",'[1]Sort Sheet'!F57)","v":"F"},{"$f":"IF('[1]Sort Sheet'!E57=0,\"\",'[1]Sort Sheet'!AT57)","v":"Y"},{"$f":"IF('[1]Sort Sheet'!E57=0,\"\",'[1]Sort Sheet'!H57)","v":"Y"},{"$f":"IF('[1]Sort Sheet'!E57=0,\"\",'[1]Sort Sheet'!J57)","v":"RB & VA Budd & Willoise Grazing Co Pty Ltd"},{"$f":"IF('[1]Sort Sheet'!E57=0,\"\",'[1]Sort Sheet'!L57)","v":"Charolais X"},{"$f":"IF('[1]Sort Sheet'!E57=0,\"\",'[1]Sort Sheet'!O57)","v":0},{"$f":"IF('[1]Sort Sheet'!P57=0,\"\",'[1]Sort Sheet'!P57)","v":224.8},{"$f":"IF('[1]Sort Sheet'!E57=0,\"\",'[1]Sort Sheet'!Q57)","v":8},{"$f":"IF('[1]Sort Sheet'!E57=0,\"\",'[1]Sort Sheet'!R57)","v":4},{"$f":"IF('[1]Sort Sheet'!E57=0,\"\",'[1]Sort Sheet'!S57)","v":70},{"$f":"IF('[1]Sort Sheet'!E57=0,\"\",'[1]Sort Sheet'!U57)","v":"1b"},{"$f":"IF('[1]Sort Sheet'!E57=0,\"\",'[1]Sort Sheet'!V57)","v":0},{"$f":"IF('[1]Sort Sheet'!E57=0,\"\",'[1]Sort Sheet'!W57)","v":1},{"$f":"IF('[1]Sort Sheet'!E57=0,\"\",'[1]Sort Sheet'!X57)","v":5.44},{"$f":"IF('[1]Sort Sheet'!E57=0,\"\",'[1]Sort Sheet'!M57)","v":55.06},{"$f":"IF('[1]Sort Sheet'!E57=0,\"\",'[1]Sort Sheet'!Z57)","v":58.47},{"$f":"IF('[1]Sort Sheet'!E57=0,\"\",'[1]Sort Sheet'!AA57)","v":10.756676557863502},{"$f":"IF('[1]Sort Sheet'!E57=0,\"\",'[1]Sort Sheet'!AB57)","v":1413.8635905044512},{"$f":"IF('[1]Sort Sheet'!E57=0,\"\",'[1]Sort Sheet'!AC57)","v":6.2894287833827898},141.38999999999999,1555.253590504451,6.9183878581158851]
[54,{"$f":"IF('[1]Sort Sheet'!D58=0,\"\",'[1]Sort Sheet'!D58)","v":191},{"$f":"IF('[1]Sort Sheet'!E58=0,\"\",'[1]Sort Sheet'!E58)","v":"317B"},{"$f":"IF('[1]Sort Sheet'!F58=0,\"\",'[1]Sort Sheet'!F58)","v":"F"},{"$f":"IF('[1]Sort Sheet'!E58=0,\"\",'[1]Sort Sheet'!AT58)","v":"Y"},{"$f":"IF('[1]Sort Sheet'!E58=0,\"\",'[1]Sort Sheet'!H58)","v":"Y"},{"$f":"IF('[1]Sort Sheet'!E58=0,\"\",'[1]Sort Sheet'!J58)","v":"Riverglen Pastoral Company"},{"$f":"IF('[1]Sort Sheet'!E58=0,\"\",'[1]Sort Sheet'!L58)","v":"Charolais X"},{"$f":"IF('[1]Sort Sheet'!E58=0,\"\",'[1]Sort Sheet'!O58)","v":0},{"$f":"IF('[1]Sort Sheet'!P58=0,\"\",'[1]Sort Sheet'!P58)","v":273.8},{"$f":"IF('[1]Sort Sheet'!E58=0,\"\",'[1]Sort Sheet'!Q58)","v":10},{"$f":"IF('[1]Sort Sheet'!E58=0,\"\",'[1]Sort Sheet'!R58)","v":5},{"$f":"IF('[1]Sort Sheet'!E58=0,\"\",'[1]Sort Sheet'!S58)","v":86},{"$f":"IF('[1]Sort Sheet'!E58=0,\"\",'[1]Sort Sheet'!U58)","v":"1b"},{"$f":"IF('[1]Sort Sheet'!E58=0,\"\",'[1]Sort Sheet'!V58)","v":1},{"$f":"IF('[1]Sort Sheet'!E58=0,\"\",'[1]Sort Sheet'!W58)","v":1},{"$f":"IF('[1]Sort Sheet'!E58=0,\"\",'[1]Sort Sheet'!X58)","v":5.59},{"$f":"IF('[1]Sort Sheet'!E58=0,\"\",'[1]Sort Sheet'!M58)","v":61.98},{"$f":"IF('[1]Sort Sheet'!E58=0,\"\",'[1]Sort Sheet'!Z58)","v":58.38},{"$f":"IF('[1]Sort Sheet'!E58=0,\"\",'[1]Sort Sheet'!AA58)","v":10.756676557863502},{"$f":"IF('[1]Sort Sheet'!E58=0,\"\",'[1]Sort Sheet'!AB58)","v":1719.3949406528191},{"$f":"IF('[1]Sort Sheet'!E58=0,\"\",'[1]Sort Sheet'!AC58)","v":6.279747774480712},171.94,1891.3349406528191,6.9077243997546347]
[55,{"$f":"IF('[1]Sort Sheet'!D59=0,\"\",'[1]Sort Sheet'!D59)","v":210},{"$f":"IF('[1]Sort Sheet'!E59=0,\"\",'[1]Sort Sheet'!E59)","v":"323B"},{"$f":"IF('[1]Sort Sheet'!F59=0,\"\",'[1]Sort Sheet'!F59)","v":"M"},{"$f":"IF('[1]Sort Sheet'!E59=0,\"\",'[1]Sort Sheet'!AT59)","v":"Y"},{"$f":"IF('[1]Sort Sheet'!E59=0,\"\",'[1]Sort Sheet'!H59)","v":"Y"},{"$f":"IF('[1]Sort Sheet'!E59=0,\"\",'[1]Sort Sheet'!J59)","v":"Rich Enterprises P/L"},{"$f":"IF('[1]Sort Sheet'!E59=0,\"\",'[1]Sort Sheet'!L59)","v":"Angus / Charolais X"},{"$f":"IF('[1]Sort Sheet'!E59=0,\"\",'[1]Sort Sheet'!O59)","v":0},{"$f":"IF('[1]Sort Sheet'!P59=0,\"\",'[1]Sort Sheet'!P59)","v":274.8},{"$f":"IF('[1]Sort Sheet'!E59=0,\"\",'[1]Sort Sheet'!Q59)","v":8},{"$f":"IF('[1]Sort Sheet'!E59=0,\"\",'[1]Sort Sheet'!R59)","v":6},{"$f":"IF('[1]Sort Sheet'!E59=0,\"\",'[1]Sort Sheet'!S59)","v":73},{"$f":"IF('[1]Sort Sheet'!E59=0,\"\",'[1]Sort Sheet'!U59)","v":"2"},{"$f":"IF('[1]Sort Sheet'!E59=0,\"\",'[1]Sort Sheet'!V59)","v":2},{"$f":"IF('[1]Sort Sheet'!E59=0,\"\",'[1]Sort Sheet'!W59)","v":1},{"$f":"IF('[1]Sort Sheet'!E59=0,\"\",'[1]Sort Sheet'!X59)","v":5.64},{"$f":"IF('[1]Sort Sheet'!E59=0,\"\",'[1]Sort Sheet'!M59)","v":58.28},{"$f":"IF('[1]Sort Sheet'!E59=0,\"\",'[1]Sort Sheet'!Z59)","v":58.35},{"$f":"IF('[1]Sort Sheet'!E59=0,\"\",'[1]Sort Sheet'!AA59)","v":10.756676557863502},{"$f":"IF('[1]Sort Sheet'!E59=0,\"\",'[1]Sort Sheet'!AB59)","v":1724.7879080118696},{"$f":"IF('[1]Sort Sheet'!E59=0,\"\",'[1]Sort Sheet'!AC59)","v":6.2765207715133533},{"$f":"IF(U63=\"\",\"\",ROUND(U63*0.1,2))","v":172.48},{"$f":"IF(W63=\"\",\"\",U63+W63)","v":1897.2679080118696},{"$f":"X63/J63","v":6.9041772489514903}]
[56,{"$f":"IF('[1]Sort Sheet'!D60=0,\"\",'[1]Sort Sheet'!D60)","v":285},{"$f":"IF('[1]Sort Sheet'!E60=0,\"\",'[1]Sort Sheet'!E60)","v":"352B"},{"$f":"IF('[1]Sort Sheet'!F60=0,\"\",'[1]Sort Sheet'!F60)","v":"M"},{"$f":"IF('[1]Sort Sheet'!E60=0,\"\",'[1]Sort Sheet'!AT60)","v":"Y"},{"$f":"IF('[1]Sort Sheet'!E60=0,\"\",'[1]Sort Sheet'!H60)","v":"Y"},{"$f":"IF('[1]Sort Sheet'!E60=0,\"\",'[1]Sort Sheet'!J60)","v":"Bremer Feedlot"},{"$f":"IF('[1]Sort Sheet'!E60=0,\"\",'[1]Sort Sheet'!L60)","v":"Angus "},{"$f":"IF('[1]Sort Sheet'!E60=0,\"\",'[1]Sort Sheet'!O60)","v":0},{"$f":"IF('[1]Sort Sheet'!P60=0,\"\",'[1]Sort Sheet'!P60)","v":276.39999999999998},{"$f":"IF('[1]Sort Sheet'!E60=0,\"\",'[1]Sort Sheet'!Q60)","v":15},{"$f":"IF('[1]Sort Sheet'!E60=0,\"\",'[1]Sort Sheet'!R60)","v":7},{"$f":"IF('[1]Sort Sheet'!E60=0,\"\",'[1]Sort Sheet'!S60)","v":76},{"$f":"IF('[1]Sort Sheet'!E60=0,\"\",'[1]Sort Sheet'!U60)","v":"3"},{"$f":"IF('[1]Sort Sheet'!E60=0,\"\",'[1]Sort Sheet'!V60)","v":1},{"$f":"IF('[1]Sort Sheet'!E60=0,\"\",'[1]Sort Sheet'!W60)","v":1},{"$f":"IF('[1]Sort Sheet'!E60=0,\"\",'[1]Sort Sheet'!X60)","v":5.61},{"$f":"IF('[1]Sort Sheet'!E60=0,\"\",'[1]Sort Sheet'!M60)","v":55.88},{"$f":"IF('[1]Sort Sheet'!E60=0,\"\",'[1]Sort Sheet'!Z60)","v":58.23},{"$f":"IF('[1]Sort Sheet'!E60=0,\"\",'[1]Sort Sheet'!AA60)","v":10.756676557863502},{"$f":"IF('[1]Sort Sheet'!E60=0,\"\",'[1]Sort Sheet'!AB60)","v":1731.2625667655782},{"$f":"IF('[1]Sort Sheet'!E60=0,\"\",'[1]Sort Sheet'!AC60)","v":6.263612759643916},{"$f":"IF(U64=\"\",\"\",ROUND(U64*0.1,2))","v":173.13},{"$f":"IF(W64=\"\",\"\",U64+W64)","v":1904.3925667655781},{"$f":"X64/J64","v":6.8899875787466653}]
[57,{"$f":"IF('[1]Sort Sheet'!D61=0,\"\",'[1]Sort Sheet'!D61)","v":200},{"$f":"IF('[1]Sort Sheet'!E61=0,\"\",'[1]Sort Sheet'!E61)","v":"319C"},{"$f":"IF('[1]Sort Sheet'!F61=0,\"\",'[1]Sort Sheet'!F61)","v":"M"},{"$f":"IF('[1]Sort Sheet'!E61=0,\"\",'[1]Sort Sheet'!AT61)","v":"Y"},{"$f":"IF('[1]Sort Sheet'!E61=0,\"\",'[1]Sort Sheet'!H61)","v":"Y"},{"$f":"IF('[1]Sort Sheet'!E61=0,\"\",'[1]Sort Sheet'!J61)","v":"Darr Creek Pastoral"},{"$f":"IF('[1]Sort Sheet'!E61=0,\"\",'[1]Sort Sheet'!L61)","v":"Angus X Limousin"},{"$f":"IF('[1]Sort Sheet'!E61=0,\"\",'[1]Sort Sheet'!O61)","v":0},{"$f":"IF('[1]Sort Sheet'!P61=0,\"\",'[1]Sort Sheet'!P61)","v":248.8},{"$f":"IF('[1]Sort Sheet'!E61=0,\"\",'[1]Sort Sheet'!Q61)","v":15},{"$f":"IF('[1]Sort Sheet'!E61=0,\"\",'[1]Sort Sheet'!R61)","v":10},{"$f":"IF('[1]Sort Sheet'!E61=0,\"\",'[1]Sort Sheet'!S61)","v":77},{"$f":"IF('[1]Sort Sheet'!E61=0,\"\",'[1]Sort Sheet'!U61)","v":"1b"},{"$f":"IF('[1]Sort Sheet'!E61=0,\"\",'[1]Sort Sheet'!V61)","v":1},{"$f":"IF('[1]Sort Sheet'!E61=0,\"\",'[1]Sort Sheet'!W61)","v":1},{"$f":"IF('[1]Sort Sheet'!E61=0,\"\",'[1]Sort Sheet'!X61)","v":5.44},{"$f":"IF('[1]Sort Sheet'!E61=0,\"\",'[1]Sort Sheet'!M61)","v":56.13},{"$f":"IF('[1]Sort Sheet'!E61=0,\"\",'[1]Sort Sheet'!Z61)","v":58.21},{"$f":"IF('[1]Sort Sheet'!E61=0,\"\",'[1]Sort Sheet'!AA61)","v":10.756676557863502},{"$f":"IF('[1]Sort Sheet'!E61=0,\"\",'[1]Sort Sheet'!AB61)","v":1557.8516023738875},{"$f":"IF('[1]Sort Sheet'!E61=0,\"\",'[1]Sort Sheet'!AC61)","v":6.261461424332345},155.79,1713.6416023738875,6.8876270191876507]
[58,{"$f":"IF('[1]Sort Sheet'!D62=0,\"\",'[1]Sort Sheet'!D62)","v":240},{"$f":"IF('[1]Sort Sheet'!E62=0,\"\",'[1]Sort Sheet'!E62)","v":"331B"},{"$f":"IF('[1]Sort Sheet'!F62=0,\"\",'[1]Sort Sheet'!F62)","v":"M"},{"$f":"IF('[1]Sort Sheet'!E62=0,\"\",'[1]Sort Sheet'!AT62)","v":"Y"},{"$f":"IF('[1]Sort Sheet'!E62=0,\"\",'[1]Sort Sheet'!H62)","v":"Y"},{"$f":"IF('[1]Sort Sheet'!E62=0,\"\",'[1]Sort Sheet'!J62)","v":"G E & E E Kroll"},{"$f":"IF('[1]Sort Sheet'!E62=0,\"\",'[1]Sort Sheet'!L62)","v":"Angus X"},{"$f":"IF('[1]Sort Sheet'!E62=0,\"\",'[1]Sort Sheet'!O62)","v":0},{"$f":"IF('[1]Sort Sheet'!P62=0,\"\",'[1]Sort Sheet'!P62)","v":294.8},{"$f":"IF('[1]Sort Sheet'!E62=0,\"\",'[1]Sort Sheet'!Q62)","v":11},{"$f":"IF('[1]Sort Sheet'!E62=0,\"\",'[1]Sort Sheet'!R62)","v":6},{"$f":"IF('[1]Sort Sheet'!E62=0,\"\",'[1]Sort Sheet'!S62)","v":77},{"$f":"IF('[1]Sort Sheet'!E62=0,\"\",'[1]Sort Sheet'!U62)","v":"3"},{"$f":"IF('[1]Sort Sheet'!E62=0,\"\",'[1]Sort Sheet'!V62)","v":1},{"$f":"IF('[1]Sort Sheet'!E62=0,\"\",'[1]Sort Sheet'!W62)","v":1},{"$f":"IF('[1]Sort Sheet'!E62=0,\"\",'[1]Sort Sheet'!X62)","v":5.68},{"$f":"IF('[1]Sort Sheet'!E62=0,\"\",'[1]Sort Sheet'!M62)","v":56.42},{"$f":"IF('[1]Sort Sheet'!E62=0,\"\",'[1]Sort Sheet'!Z62)","v":58.08},{"$f":"IF('[1]Sort Sheet'!E62=0,\"\",'[1]Sort Sheet'!AA62)","v":10.756676557863502},{"$f":"IF('[1]Sort Sheet'!E62=0,\"\",'[1]Sort Sheet'!AB62)","v":1841.7564391691394},{"$f":"IF('[1]Sort Sheet'!E62=0,\"\",'[1]Sort Sheet'!AC62)","v":6.2474777448071208},184.18,2025.9364391691395,6.8722402956890756]
[59,{"$f":"IF('[1]Sort Sheet'!D63=0,\"\",'[1]Sort Sheet'!D63)","v":255},{"$f":"IF('[1]Sort Sheet'!E63=0,\"\",'[1]Sort Sheet'!E63)","v":"339A"},{"$f":"IF('[1]Sort Sheet'!F63=0,\"\",'[1]Sort Sheet'!F63)","v":"F"},{"$f":"IF('[1]Sort Sheet'!E63=0,\"\",'[1]Sort Sheet'!AT63)","v":"Y"},{"$f":"IF('[1]Sort Sheet'!E63=0,\"\",'[1]Sort Sheet'!H63)","v":"Y"},{"$f":"IF('[1]Sort Sheet'!E63=0,\"\",'[1]Sort Sheet'!J63)","v":"RB & VA Budd & Willoise Grazing Co Pty Ltd"},{"$f":"IF('[1]Sort Sheet'!E63=0,\"\",'[1]Sort Sheet'!L63)","v":"Charolais X"},{"$f":"IF('[1]Sort Sheet'!E63=0,\"\",'[1]Sort Sheet'!O63)","v":0},{"$f":"IF('[1]Sort Sheet'!P63=0,\"\",'[1]Sort Sheet'!P63)","v":229.4},{"$f":"IF('[1]Sort Sheet'!E63=0,\"\",'[1]Sort Sheet'!Q63)","v":12},{"$f":"IF('[1]Sort Sheet'!E63=0,\"\",'[1]Sort Sheet'!R63)","v":5},{"$f":"IF('[1]Sort Sheet'!E63=0,\"\",'[1]Sort Sheet'!S63)","v":71},{"$f":"IF('[1]Sort Sheet'!E63=0,\"\",'[1]Sort Sheet'!U63)","v":"2"},{"$f":"IF('[1]Sort Sheet'!E63=0,\"\",'[1]Sort Sheet'!V63)","v":1},{"$f":"IF('[1]Sort Sheet'!E63=0,\"\",'[1]Sort Sheet'!W63)","v":1},{"$f":"IF('[1]Sort Sheet'!E63=0,\"\",'[1]Sort Sheet'!X63)","v":5.54},{"$f":"IF('[1]Sort Sheet'!E63=0,\"\",'[1]Sort Sheet'!M63)","v":55.63},{"$f":"IF('[1]Sort Sheet'!E63=0,\"\",'[1]Sort Sheet'!Z63)","v":57.98},{"$f":"IF('[1]Sort Sheet'!E63=0,\"\",'[1]Sort Sheet'!AA63)","v":10.756676557863502},{"$f":"IF('[1]Sort Sheet'!E63=0,\"\",'[1]Sort Sheet'!AB63)","v":1430.7038130563797},{"$f":"IF('[1]Sort Sheet'!E63=0,\"\",'[1]Sort Sheet'!AC63)","v":6.2367210682492571},143.07,1573.7738130563796,6.8603915128874435]
[60,{"$f":"IF('[1]Sort Sheet'!D64=0,\"\",'[1]Sort Sheet'!D64)","v":215},{"$f":"IF('[1]Sort Sheet'!E64=0,\"\",'[1]Sort Sheet'!E64)","v":"327A"},{"$f":"IF('[1]Sort Sheet'!F64=0,\"\",'[1]Sort Sheet'!F64)","v":"F"},{"$f":"IF('[1]Sort Sheet'!E64=0,\"\",'[1]Sort Sheet'!AT64)","v":"Y"},{"$f":"IF('[1]Sort Sheet'!E64=0,\"\",'[1]Sort Sheet'!H64)","v":"Y"},{"$f":"IF('[1]Sort Sheet'!E64=0,\"\",'[1]Sort Sheet'!J64)","v":"D J & K L Hart"},{"$f":"IF('[1]Sort Sheet'!E64=0,\"\",'[1]Sort Sheet'!L64)","v":"Angus / Charolais X"},{"$f":"IF('[1]Sort Sheet'!E64=0,\"\",'[1]Sort Sheet'!O64)","v":0},{"$f":"IF('[1]Sort Sheet'!P64=0,\"\",'[1]Sort Sheet'!P64)","v":270.8},{"$f":"IF('[1]Sort Sheet'!E64=0,\"\",'[1]Sort Sheet'!Q64)","v":10},{"$f":"IF('[1]Sort Sheet'!E64=0,\"\",'[1]Sort Sheet'!R64)","v":5},{"$f":"IF('[1]Sort Sheet'!E64=0,\"\",'[1]Sort Sheet'!S64)","v":83},{"$f":"IF('[1]Sort Sheet'!E64=0,\"\",'[1]Sort Sheet'!U64)","v":"2"},{"$f":"IF('[1]Sort Sheet'!E64=0,\"\",'[1]Sort Sheet'!V64)","v":1},{"$f":"IF('[1]Sort Sheet'!E64=0,\"\",'[1]Sort Sheet'!W64)","v":1},{"$f":"IF('[1]Sort Sheet'!E64=0,\"\",'[1]Sort Sheet'!X64)","v":5.63},{"$f":"IF('[1]Sort Sheet'!E64=0,\"\",'[1]Sort Sheet'!M64)","v":54.62},{"$f":"IF('[1]Sort Sheet'!E64=0,\"\",'[1]Sort Sheet'!Z64)","v":57.97},{"$f":"IF('[1]Sort Sheet'!E64=0,\"\",'[1]Sort Sheet'!AA64)","v":10.756676557863502},{"$f":"IF('[1]Sort Sheet'!E64=0,\"\",'[1]Sort Sheet'!AB64)","v":1688.6127744807122},{"$f":"IF('[1]Sort Sheet'!E64=0,\"\",'[1]Sort Sheet'!AC64)","v":6.2356454005934721},168.86,1857.4727744807124,6.8592052233408873]
[61,{"$f":"IF('[1]Sort Sheet'!D65=0,\"\",'[1]Sort Sheet'!D65)","v":283},{"$f":"IF('[1]Sort Sheet'!E65=0,\"\",'[1]Sort Sheet'!E65)","v":"352C"},{"$f":"IF('[1]Sort Sheet'!F65=0,\"\",'[1]Sort Sheet'!F65)","v":"M"},{"$f":"IF('[1]Sort Sheet'!E65=0,\"\",'[1]Sort Sheet'!AT65)","v":"Y"},{"$f":"IF('[1]Sort Sheet'!E65=0,\"\",'[1]Sort Sheet'!H65)","v":"Y"},{"$f":"IF('[1]Sort Sheet'!E65=0,\"\",'[1]Sort Sheet'!J65)","v":"Bremer Feedlot"},{"$f":"IF('[1]Sort Sheet'!E65=0,\"\",'[1]Sort Sheet'!L65)","v":"Angus "},{"$f":"IF('[1]Sort Sheet'!E65=0,\"\",'[1]Sort Sheet'!O65)","v":0},{"$f":"IF('[1]Sort Sheet'!P65=0,\"\",'[1]Sort Sheet'!P65)","v":299.8},{"$f":"IF('[1]Sort Sheet'!E65=0,\"\",'[1]Sort Sheet'!Q65)","v":10},{"$f":"IF('[1]Sort Sheet'!E65=0,\"\",'[1]Sort Sheet'!R65)","v":7},{"$f":"IF('[1]Sort Sheet'!E65=0,\"\",'[1]Sort Sheet'!S65)","v":81},{"$f":"IF('[1]Sort Sheet'!E65=0,\"\",'[1]Sort Sheet'!U65)","v":"2"},{"$f":"IF('[1]Sort Sheet'!E65=0,\"\",'[1]Sort Sheet'!V65)","v":1},{"$f":"IF('[1]Sort Sheet'!E65=0,\"\",'[1]Sort Sheet'!W65)","v":1},{"$f":"IF('[1]Sort Sheet'!E65=0,\"\",'[1]Sort Sheet'!X65)","v":5.5},{"$f":"IF('[1]Sort Sheet'!E65=0,\"\",'[1]Sort Sheet'!M65)","v":56.78},{"$f":"IF('[1]Sort Sheet'!E65=0,\"\",'[1]Sort Sheet'!Z65)","v":57.95},{"$f":"IF('[1]Sort Sheet'!E65=0,\"\",'[1]Sort Sheet'!AA65)","v":10.756676557863502},{"$f":"IF('[1]Sort Sheet'!E65=0,\"\",'[1]Sort Sheet'!AB65)","v":1868.8015207715134},{"$f":"IF('[1]Sort Sheet'!E65=0,\"\",'[1]Sort Sheet'!AC65)","v":6.2334940652818993},186.88,2055.6815207715135,6.8568429645480773]
[62,{"$f":"IF('[1]Sort Sheet'!D66=0,\"\",'[1]Sort Sheet'!D66)","v":195},{"$f":"IF('[1]Sort Sheet'!E66=0,\"\",'[1]Sort Sheet'!E66)","v":"318C"},{"$f":"IF('[1]Sort Sheet'!F66=0,\"\",'[1]Sort Sheet'!F66)","v":"F"},{"$f":"IF('[1]Sort Sheet'!E66=0,\"\",'[1]Sort Sheet'!AT66)","v":"Y"},{"$f":"IF('[1]Sort Sheet'!E66=0,\"\",'[1]Sort Sheet'!H66)","v":"Y"},{"$f":"IF('[1]Sort Sheet'!E66=0,\"\",'[1]Sort Sheet'!J66)","v":"Riverglen Pastoral Company"},{"$f":"IF('[1]Sort Sheet'!E66=0,\"\",'[1]Sort Sheet'!L66)","v":"Charolais X"},{"$f":"IF('[1]Sort Sheet'!E66=0,\"\",'[1]Sort Sheet'!O66)","v":0},{"$f":"IF('[1]Sort Sheet'!P66=0,\"\",'[1]Sort Sheet'!P66)","v":274},{"$f":"IF('[1]Sort Sheet'!E66=0,\"\",'[1]Sort Sheet'!Q66)","v":6},{"$f":"IF('[1]Sort Sheet'!E66=0,\"\",'[1]Sort Sheet'!R66)","v":5},{"$f":"IF('[1]Sort Sheet'!E66=0,\"\",'[1]Sort Sheet'!S66)","v":85},{"$f":"IF('[1]Sort Sheet'!E66=0,\"\",'[1]Sort Sheet'!U66)","v":"3"},{"$f":"IF('[1]Sort Sheet'!E66=0,\"\",'[1]Sort Sheet'!V66)","v":0},{"$f":"IF('[1]Sort Sheet'!E66=0,\"\",'[1]Sort Sheet'!W66)","v":1},{"$f":"IF('[1]Sort Sheet'!E66=0,\"\",'[1]Sort Sheet'!X66)","v":5.61},{"$f":"IF('[1]Sort Sheet'!E66=0,\"\",'[1]Sort Sheet'!M66)","v":59.67},{"$f":"IF('[1]Sort Sheet'!E66=0,\"\",'[1]Sort Sheet'!Z66)","v":57.95},{"$f":"IF('[1]Sort Sheet'!E66=0,\"\",'[1]Sort Sheet'!AA66)","v":10.756676557863502},{"$f":"IF('[1]Sort Sheet'!E66=0,\"\",'[1]Sort Sheet'!AB66)","v":1707.9773738872404},{"$f":"IF('[1]Sort Sheet'!E66=0,\"\",'[1]Sort Sheet'!AC66)","v":6.2334940652818993},170.8,1878.7773738872404,6.8568517295154763]
[63,{"$f":"IF('[1]Sort Sheet'!D67=0,\"\",'[1]Sort Sheet'!D67)","v":193},{"$f":"IF('[1]Sort Sheet'!E67=0,\"\",'[1]Sort Sheet'!E67)","v":"318B"},{"$f":"IF('[1]Sort Sheet'!F67=0,\"\",'[1]Sort Sheet'!F67)","v":"F"},{"$f":"IF('[1]Sort Sheet'!E67=0,\"\",'[1]Sort Sheet'!AT67)","v":"Y"},{"$f":"IF('[1]Sort Sheet'!E67=0,\"\",'[1]Sort Sheet'!H67)","v":"Y"},{"$f":"IF('[1]Sort Sheet'!E67=0,\"\",'[1]Sort Sheet'!J67)","v":"Riverglen Pastoral Company"},{"$f":"IF('[1]Sort Sheet'!E67=0,\"\",'[1]Sort Sheet'!L67)","v":"Charolais X"},{"$f":"IF('[1]Sort Sheet'!E67=0,\"\",'[1]Sort Sheet'!O67)","v":0},{"$f":"IF('[1]Sort Sheet'!P67=0,\"\",'[1]Sort Sheet'!P67)","v":305.2},{"$f":"IF('[1]Sort Sheet'!E67=0,\"\",'[1]Sort Sheet'!Q67)","v":6},{"$f":"IF('[1]Sort Sheet'!E67=0,\"\",'[1]Sort Sheet'!R67)","v":6},{"$f":"IF('[1]Sort Sheet'!E67=0,\"\",'[1]Sort Sheet'!S67)","v":95},{"$f":"IF('[1]Sort Sheet'!E67=0,\"\",'[1]Sort Sheet'!U67)","v":"1b"},{"$f":"IF('[1]Sort Sheet'!E67=0,\"\",'[1]Sort Sheet'!V67)","v":0},{"$f":"IF('[1]Sort Sheet'!E67=0,\"\",'[1]Sort Sheet'!W67)","v":1},{"$f":"IF('[1]Sort Sheet'!E67=0,\"\",'[1]Sort Sheet'!X67)","v":5.4},{"$f":"IF('[1]Sort Sheet'!E67=0,\"\",'[1]Sort Sheet'!M67)","v":60.1},{"$f":"IF('[1]Sort Sheet'!E67=0,\"\",'[1]Sort Sheet'!Z67)","v":57.85},{"$f":"IF('[1]Sort Sheet'!E67=0,\"\",'[1]Sort Sheet'!AA67)","v":10.756676557863502},{"$f":"IF('[1]Sort Sheet'!E67=0,\"\",'[1]Sort Sheet'!AB67)","v":1899.1794510385757},{"$f":"IF('[1]Sort Sheet'!E67=0,\"\",'[1]Sort Sheet'!AC67)","v":6.2227373887240365},189.92,2089.0994510385758,6.8450178605457923]
[64,{"$f":"IF('[1]Sort Sheet'!D68=0,\"\",'[1]Sort Sheet'!D68)","v":252},{"$f":"IF('[1]Sort Sheet'!E68=0,\"\",'[1]Sort Sheet'!E68)","v":"336B"},{"$f":"IF('[1]Sort Sheet'!F68=0,\"\",'[1]Sort Sheet'!F68)","v":"F"},{"$f":"IF('[1]Sort Sheet'!E68=0,\"\",'[1]Sort Sheet'!AT68)","v":"Y"},{"$f":"IF('[1]Sort Sheet'!E68=0,\"\",'[1]Sort Sheet'!H68)","v":"Y"},{"$f":"IF('[1]Sort Sheet'!E68=0,\"\",'[1]Sort Sheet'!J68)","v":"Ben & Megan Drynan "},{"$f":"IF('[1]Sort Sheet'!E68=0,\"\",'[1]Sort Sheet'!L68)","v":"Charolais "},{"$f":"IF('[1]Sort Sheet'!E68=0,\"\",'[1]Sort Sheet'!O68)","v":0},{"$f":"IF('[1]Sort Sheet'!P68=0,\"\",'[1]Sort Sheet'!P68)","v":262.60000000000002},{"$f":"IF('[1]Sort Sheet'!E68=0,\"\",'[1]Sort Sheet'!Q68)","v":12},{"$f":"IF('[1]Sort Sheet'!E68=0,\"\",'[1]Sort Sheet'!R68)","v":6},{"$f":"IF('[1]Sort Sheet'!E68=0,\"\",'[1]Sort Sheet'!S68)","v":82},{"$f":"IF('[1]Sort Sheet'!E68=0,\"\",'[1]Sort Sheet'!U68)","v":"1b"},{"$f":"IF('[1]Sort Sheet'!E68=0,\"\",'[1]Sort Sheet'!V68)","v":1},{"$f":"IF('[1]Sort Sheet'!E68=0,\"\",'[1]Sort Sheet'!W68)","v":1},{"$f":"IF('[1]Sort Sheet'!E68=0,\"\",'[1]Sort Sheet'!X68)","v":5.54},{"$f":"IF('[1]Sort Sheet'!E68=0,\"\",'[1]Sort Sheet'!M68)","v":56.83},{"$f":"IF('[1]Sort Sheet'!E68=0,\"\",'[1]Sort Sheet'!Z68)","v":57.78},{"$f":"IF('[1]Sort Sheet'!E68=0,\"\",'[1]Sort Sheet'!AA68)","v":10.756676557863502},{"$f":"IF('[1]Sort Sheet'!E68=0,\"\",'[1]Sort Sheet'!AB68)","v":1632.1135459940656},{"$f":"IF('[1]Sort Sheet'!E68=0,\"\",'[1]Sort Sheet'!AC68)","v":6.2152077151335314},163.21,1795.3235459940656,6.8367233282333038]
[65,{"$f":"IF('[1]Sort Sheet'!D69=0,\"\",'[1]Sort Sheet'!D69)","v":286},{"$f":"IF('[1]Sort Sheet'!E69=0,\"\",'[1]Sort Sheet'!E69)","v":"348C"},{"$f":"IF('[1]Sort Sheet'!F69=0,\"\",'[1]Sort Sheet'!F69)","v":"M"},{"$f":"IF('[1]Sort Sheet'!E69=0,\"\",'[1]Sort Sheet'!AT69)","v":"Y"},{"$f":"IF('[1]Sort Sheet'!E69=0,\"\",'[1]Sort Sheet'!H69)","v":"Y"},{"$f":"IF('[1]Sort Sheet'!E69=0,\"\",'[1]Sort Sheet'!J69)","v":"Bremer Feedlot"},{"$f":"IF('[1]Sort Sheet'!E69=0,\"\",'[1]Sort Sheet'!L69)","v":"Angus "},{"$f":"IF('[1]Sort Sheet'!E69=0,\"\",'[1]Sort Sheet'!O69)","v":0},{"$f":"IF('[1]Sort Sheet'!P69=0,\"\",'[1]Sort Sheet'!P69)","v":285.2},{"$f":"IF('[1]Sort Sheet'!E69=0,\"\",'[1]Sort Sheet'!Q69)","v":21},{"$f":"IF('[1]Sort Sheet'!E69=0,\"\",'[1]Sort Sheet'!R69)","v":7},{"$f":"IF('[1]Sort Sheet'!E69=0,\"\",'[1]Sort Sheet'!S69)","v":76},{"$f":"IF('[1]Sort Sheet'!E69=0,\"\",'[1]Sort Sheet'!U69)","v":"1b"},{"$f":"IF('[1]Sort Sheet'!E69=0,\"\",'[1]Sort Sheet'!V69)","v":1},{"$f":"IF('[1]Sort Sheet'!E69=0,\"\",'[1]Sort Sheet'!W69)","v":1},{"$f":"IF('[1]Sort Sheet'!E69=0,\"\",'[1]Sort Sheet'!X69)","v":5.44},{"$f":"IF('[1]Sort Sheet'!E69=0,\"\",'[1]Sort Sheet'!M69)","v":55.54},{"$f":"IF('[1]Sort Sheet'!E69=0,\"\",'[1]Sort Sheet'!Z69)","v":57.74},{"$f":"IF('[1]Sort Sheet'!E69=0,\"\",'[1]Sort Sheet'!AA69)","v":10.756676557863502},{"$f":"IF('[1]Sort Sheet'!E69=0,\"\",'[1]Sort Sheet'!AB69)","v":1771.3501186943622},{"$f":"IF('[1]Sort Sheet'!E69=0,\"\",'[1]Sort Sheet'!AC69)","v":6.2109050445103868},177.14,1948.4901186943621,6.8320130389002882]
[66,{"$f":"IF('[1]Sort Sheet'!D70=0,\"\",'[1]Sort Sheet'!D70)","v":229},{"$f":"IF('[1]Sort Sheet'!E70=0,\"\",'[1]Sort Sheet'!E70)","v":"329C"},{"$f":"IF('[1]Sort Sheet'!F70=0,\"\",'[1]Sort Sheet'!F70)","v":"F"},{"$f":"IF('[1]Sort Sheet'!E70=0,\"\",'[1]Sort Sheet'!AT70)","v":"Y"},{"$f":"IF('[1]Sort Sheet'!E70=0,\"\",'[1]Sort Sheet'!H70)","v":"Y"},{"$f":"IF('[1]Sort Sheet'!E70=0,\"\",'[1]Sort Sheet'!J70)","v":"Juandah Grazing"},{"$f":"IF('[1]Sort Sheet'!E70=0,\"\",'[1]Sort Sheet'!L70)","v":"Charolais X Angus"},{"$f":"IF('[1]Sort Sheet'!E70=0,\"\",'[1]Sort Sheet'!O70)","v":0},{"$f":"IF('[1]Sort Sheet'!P70=0,\"\",'[1]Sort Sheet'!P70)","v":286},{"$f":"IF('[1]Sort Sheet'!E70=0,\"\",'[1]Sort Sheet'!Q70)","v":11},{"$f":"IF('[1]Sort Sheet'!E70=0,\"\",'[1]Sort Sheet'!R70)","v":7},{"$f":"IF('[1]Sort Sheet'!E70=0,\"\",'[1]Sort Sheet'!S70)","v":91},{"$f":"IF('[1]Sort Sheet'!E70=0,\"\",'[1]Sort Sheet'!U70)","v":"2"},{"$f":"IF('[1]Sort Sheet'!E70=0,\"\",'[1]Sort Sheet'!V70)","v":1},{"$f":"IF('[1]Sort Sheet'!E70=0,\"\",'[1]Sort Sheet'!W70)","v":1},{"$f":"IF('[1]Sort Sheet'!E70=0,\"\",'[1]Sort Sheet'!X70)","v":5.6},{"$f":"IF('[1]Sort Sheet'!E70=0,\"\",'[1]Sort Sheet'!M70)","v":56.57},{"$f":"IF('[1]Sort Sheet'!E70=0,\"\",'[1]Sort Sheet'!Z70)","v":57.67},{"$f":"IF('[1]Sort Sheet'!E70=0,\"\",'[1]Sort Sheet'!AA70)","v":10.756676557863502},{"$f":"IF('[1]Sort Sheet'!E70=0,\"\",'[1]Sort Sheet'!AB70)","v":1774.165356083086},{"$f":"IF('[1]Sort Sheet'!E70=0,\"\",'[1]Sort Sheet'!AC70)","v":6.2033753709198809},177.42,1951.585356083086,6.8237250212695315]
[67,{"$f":"IF('[1]Sort Sheet'!D71=0,\"\",'[1]Sort Sheet'!D71)","v":280},{"$f":"IF('[1]Sort Sheet'!E71=0,\"\",'[1]Sort Sheet'!E71)","v":"352A"},{"$f":"IF('[1]Sort Sheet'!F71=0,\"\",'[1]Sort Sheet'!F71)","v":"M"},{"$f":"IF('[1]Sort Sheet'!E71=0,\"\",'[1]Sort Sheet'!AT71)","v":"Y"},{"$f":"IF('[1]Sort Sheet'!E71=0,\"\",'[1]Sort Sheet'!H71)","v":"Y"},{"$f":"IF('[1]Sort Sheet'!E71=0,\"\",'[1]Sort Sheet'!J71)","v":"Bremer Feedlot"},{"$f":"IF('[1]Sort Sheet'!E71=0,\"\",'[1]Sort Sheet'!L71)","v":"Angus "},{"$f":"IF('[1]Sort Sheet'!E71=0,\"\",'[1]Sort Sheet'!O71)","v":0},{"$f":"IF('[1]Sort Sheet'!P71=0,\"\",'[1]Sort Sheet'!P71)","v":274.60000000000002},{"$f":"IF('[1]Sort Sheet'!E71=0,\"\",'[1]Sort Sheet'!Q71)","v":14},{"$f":"IF('[1]Sort Sheet'!E71=0,\"\",'[1]Sort Sheet'!R71)","v":10},{"$f":"IF('[1]Sort Sheet'!E71=0,\"\",'[1]Sort Sheet'!S71)","v":80},{"$f":"IF('[1]Sort Sheet'!E71=0,\"\",'[1]Sort Sheet'!U71)","v":"1b"},{"$f":"IF('[1]Sort Sheet'!E71=0,\"\",'[1]Sort Sheet'!V71)","v":0},{"$f":"IF('[1]Sort Sheet'!E71=0,\"\",'[1]Sort Sheet'!W71)","v":1},{"$f":"IF('[1]Sort Sheet'!E71=0,\"\",'[1]Sort Sheet'!X71)","v":5.43},{"$f":"IF('[1]Sort Sheet'!E71=0,\"\",'[1]Sort Sheet'!M71)","v":55.62},{"$f":"IF('[1]Sort Sheet'!E71=0,\"\",'[1]Sort Sheet'!Z71)","v":57.54},{"$f":"IF('[1]Sort Sheet'!E71=0,\"\",'[1]Sort Sheet'!AA71)","v":10.756676557863502},{"$f":"IF('[1]Sort Sheet'!E71=0,\"\",'[1]Sort Sheet'!AB71)","v":1699.6069584569734},{"$f":"IF('[1]Sort Sheet'!E71=0,\"\",'[1]Sort Sheet'!AC71)","v":6.1893916913946585},169.96,1869.5669584569735,6.8083283265002672]
[68,{"$f":"IF('[1]Sort Sheet'!D72=0,\"\",'[1]Sort Sheet'!D72)","v":228},{"$f":"IF('[1]Sort Sheet'!E72=0,\"\",'[1]Sort Sheet'!E72)","v":"330B"},{"$f":"IF('[1]Sort Sheet'!F72=0,\"\",'[1]Sort Sheet'!F72)","v":"F"},{"$f":"IF('[1]Sort Sheet'!E72=0,\"\",'[1]Sort Sheet'!AT72)","v":"Y"},{"$f":"IF('[1]Sort Sheet'!E72=0,\"\",'[1]Sort Sheet'!H72)","v":"Y"},{"$f":"IF('[1]Sort Sheet'!E72=0,\"\",'[1]Sort Sheet'!J72)","v":"Juandah Grazing"},{"$f":"IF('[1]Sort Sheet'!E72=0,\"\",'[1]Sort Sheet'!L72)","v":"Charolais X Droughtmaster"},{"$f":"IF('[1]Sort Sheet'!E72=0,\"\",'[1]Sort Sheet'!O72)","v":0},{"$f":"IF('[1]Sort Sheet'!P72=0,\"\",'[1]Sort Sheet'!P72)","v":269.39999999999998},{"$f":"IF('[1]Sort Sheet'!E72=0,\"\",'[1]Sort Sheet'!Q72)","v":12},{"$f":"IF('[1]Sort Sheet'!E72=0,\"\",'[1]Sort Sheet'!R72)","v":5},{"$f":"IF('[1]Sort Sheet'!E72=0,\"\",'[1]Sort Sheet'!S72)","v":79},{"$f":"IF('[1]Sort Sheet'!E72=0,\"\",'[1]Sort Sheet'!U72)","v":"2"},{"$f":"IF('[1]Sort Sheet'!E72=0,\"\",'[1]Sort Sheet'!V72)","v":1},{"$f":"IF('[1]Sort Sheet'!E72=0,\"\",'[1]Sort Sheet'!W72)","v":1},{"$f":"IF('[1]Sort Sheet'!E72=0,\"\",'[1]Sort Sheet'!X72)","v":5.61},{"$f":"IF('[1]Sort Sheet'!E72=0,\"\",'[1]Sort Sheet'!M72)","v":55.68},{"$f":"IF('[1]Sort Sheet'!E72=0,\"\",'[1]Sort Sheet'!Z72)","v":57.43},{"$f":"IF('[1]Sort Sheet'!E72=0,\"\",'[1]Sort Sheet'!AA72)","v":10.756676557863502},{"$f":"IF('[1]Sort Sheet'!E72=0,\"\",'[1]Sort Sheet'!AB72)","v":1664.2344881305637},{"$f":"IF('[1]Sort Sheet'!E72=0,\"\",'[1]Sort Sheet'!AC72)","v":6.1775593471810089},166.42,1830.6544881305638,6.7953024800689086]
[69,{"$f":"IF('[1]Sort Sheet'!D73=0,\"\",'[1]Sort Sheet'!D73)","v":197},{"$f":"IF('[1]Sort Sheet'!E73=0,\"\",'[1]Sort Sheet'!E73)","v":"317A"},{"$f":"IF('[1]Sort Sheet'!F73=0,\"\",'[1]Sort Sheet'!F73)","v":"F"},{"$f":"IF('[1]Sort Sheet'!E73=0,\"\",'[1]Sort Sheet'!AT73)","v":"Y"},{"$f":"IF('[1]Sort Sheet'!E73=0,\"\",'[1]Sort Sheet'!H73)","v":"Y"},{"$f":"IF('[1]Sort Sheet'!E73=0,\"\",'[1]Sort Sheet'!J73)","v":"Riverglen Pastoral Company"},{"$f":"IF('[1]Sort Sheet'!E73=0,\"\",'[1]Sort Sheet'!L73)","v":"Charolais X"},{"$f":"IF('[1]Sort Sheet'!E73=0,\"\",'[1]Sort Sheet'!O73)","v":0},{"$f":"IF('[1]Sort Sheet'!P73=0,\"\",'[1]Sort Sheet'!P73)","v":290.60000000000002},{"$f":"IF('[1]Sort Sheet'!E73=0,\"\",'[1]Sort Sheet'!Q73)","v":18},{"$f":"IF('[1]Sort Sheet'!E73=0,\"\",'[1]Sort Sheet'!R73)","v":4},{"$f":"IF('[1]Sort Sheet'!E73=0,\"\",'[1]Sort Sheet'!S73)","v":83},{"$f":"IF('[1]Sort Sheet'!E73=0,\"\",'[1]Sort Sheet'!U73)","v":"2"},{"$f":"IF('[1]Sort Sheet'!E73=0,\"\",'[1]Sort Sheet'!V73)","v":1},{"$f":"IF('[1]Sort Sheet'!E73=0,\"\",'[1]Sort Sheet'!W73)","v":1},{"$f":"IF('[1]Sort Sheet'!E73=0,\"\",'[1]Sort Sheet'!X73)","v":5.62},{"$f":"IF('[1]Sort Sheet'!E73=0,\"\",'[1]Sort Sheet'!M73)","v":58.18},{"$f":"IF('[1]Sort Sheet'!E73=0,\"\",'[1]Sort Sheet'!Z73)","v":57.41},{"$f":"IF('[1]Sort Sheet'!E73=0,\"\",'[1]Sort Sheet'!AA73)","v":10.756676557863502},{"$f":"IF('[1]Sort Sheet'!E73=0,\"\",'[1]Sort Sheet'!AB73)","v":1794.5735682492584},{"$f":"IF('[1]Sort Sheet'!E73=0,\"\",'[1]Sort Sheet'!AC73)","v":6.175408011869437},179.46,1974.0335682492585,6.79295790863475]
[70,{"$f":"IF('[1]Sort Sheet'!D74=0,\"\",'[1]Sort Sheet'!D74)","v":242},{"$f":"IF('[1]Sort Sheet'!E74=0,\"\",'[1]Sort Sheet'!E74)","v":"335B"},{"$f":"IF('[1]Sort Sheet'!F74=0,\"\",'[1]Sort Sheet'!F74)","v":"F"},{"$f":"IF('[1]Sort Sheet'!E74=0,\"\",'[1]Sort Sheet'!AT74)","v":"Y"},{"$f":"IF('[1]Sort Sheet'!E74=0,\"\",'[1]Sort Sheet'!H74)","v":"Y"},{"$f":"IF('[1]Sort Sheet'!E74=0,\"\",'[1]Sort Sheet'!J74)","v":"Midge Thompson"},{"$f":"IF('[1]Sort Sheet'!E74=0,\"\",'[1]Sort Sheet'!L74)","v":"Limousin X"},{"$f":"IF('[1]Sort Sheet'!E74=0,\"\",'[1]Sort Sheet'!O74)","v":0},{"$f":"IF('[1]Sort Sheet'!P74=0,\"\",'[1]Sort Sheet'!P74)","v":278.60000000000002},{"$f":"IF('[1]Sort Sheet'!E74=0,\"\",'[1]Sort Sheet'!Q74)","v":8},{"$f":"IF('[1]Sort Sheet'!E74=0,\"\",'[1]Sort Sheet'!R74)","v":7},{"$f":"IF('[1]Sort Sheet'!E74=0,\"\",'[1]Sort Sheet'!S74)","v":87},{"$f":"IF('[1]Sort Sheet'!E74=0,\"\",'[1]Sort Sheet'!U74)","v":"2"},{"$f":"IF('[1]Sort Sheet'!E74=0,\"\",'[1]Sort Sheet'!V74)","v":1},{"$f":"IF('[1]Sort Sheet'!E74=0,\"\",'[1]Sort Sheet'!W74)","v":2},{"$f":"IF('[1]Sort Sheet'!E74=0,\"\",'[1]Sort Sheet'!X74)","v":5.58},{"$f":"IF('[1]Sort Sheet'!E74=0,\"\",'[1]Sort Sheet'!M74)","v":61.01},{"$f":"IF('[1]Sort Sheet'!E74=0,\"\",'[1]Sort Sheet'!Z74)","v":57.4},{"$f":"IF('[1]Sort Sheet'!E74=0,\"\",'[1]Sort Sheet'!AA74)","v":10.756676557863502},{"$f":"IF('[1]Sort Sheet'!E74=0,\"\",'[1]Sort Sheet'!AB74)","v":1720.168991097923},{"$f":"IF('[1]Sort Sheet'!E74=0,\"\",'[1]Sort Sheet'!AC74)","v":6.1743323442136502},172.02,1892.188991097923,6.7917767088941954]
[71,{"$f":"IF('[1]Sort Sheet'!D75=0,\"\",'[1]Sort Sheet'!D75)","v":198},{"$f":"IF('[1]Sort Sheet'!E75=0,\"\",'[1]Sort Sheet'!E75)","v":"318A"},{"$f":"IF('[1]Sort Sheet'!F75=0,\"\",'[1]Sort Sheet'!F75)","v":"F"},{"$f":"IF('[1]Sort Sheet'!E75=0,\"\",'[1]Sort Sheet'!AT75)","v":"Y"},{"$f":"IF('[1]Sort Sheet'!E75=0,\"\",'[1]Sort Sheet'!H75)","v":"Y"},{"$f":"IF('[1]Sort Sheet'!E75=0,\"\",'[1]Sort Sheet'!J75)","v":"Riverglen Pastoral Company"},{"$f":"IF('[1]Sort Sheet'!E75=0,\"\",'[1]Sort Sheet'!L75)","v":"Charolais X"},{"$f":"IF('[1]Sort Sheet'!E75=0,\"\",'[1]Sort Sheet'!O75)","v":0},{"$f":"IF('[1]Sort Sheet'!P75=0,\"\",'[1]Sort Sheet'!P75)","v":286.39999999999998},{"$f":"IF('[1]Sort Sheet'!E75=0,\"\",'[1]Sort Sheet'!Q75)","v":10},{"$f":"IF('[1]Sort Sheet'!E75=0,\"\",'[1]Sort Sheet'!R75)","v":4},{"$f":"IF('[1]Sort Sheet'!E75=0,\"\",'[1]Sort Sheet'!S75)","v":80},{"$f":"IF('[1]Sort Sheet'!E75=0,\"\",'[1]Sort Sheet'!U75)","v":"1b"},{"$f":"IF('[1]Sort Sheet'!E75=0,\"\",'[1]Sort Sheet'!V75)","v":0},{"$f":"IF('[1]Sort Sheet'!E75=0,\"\",'[1]Sort Sheet'!W75)","v":1},{"$f":"IF('[1]Sort Sheet'!E75=0,\"\",'[1]Sort Sheet'!X75)","v":5.47},{"$f":"IF('[1]Sort Sheet'!E75=0,\"\",'[1]Sort Sheet'!M75)","v":60.23},{"$f":"IF('[1]Sort Sheet'!E75=0,\"\",'[1]Sort Sheet'!Z75)","v":57.35},{"$f":"IF('[1]Sort Sheet'!E75=0,\"\",'[1]Sort Sheet'!AA75)","v":10.756676557863502},{"$f":"IF('[1]Sort Sheet'!E75=0,\"\",'[1]Sort Sheet'!AB75)","v":1766.7884272997035},{"$f":"IF('[1]Sort Sheet'!E75=0,\"\",'[1]Sort Sheet'!AC75)","v":6.1689540059347197},176.68,1943.4684272997035,6.7858534472755014]
[72,{"$f":"IF('[1]Sort Sheet'!D76=0,\"\",'[1]Sort Sheet'!D76)","v":288},{"$f":"IF('[1]Sort Sheet'!E76=0,\"\",'[1]Sort Sheet'!E76)","v":"347C"},{"$f":"IF('[1]Sort Sheet'!F76=0,\"\",'[1]Sort Sheet'!F76)","v":"M"},{"$f":"IF('[1]Sort Sheet'!E76=0,\"\",'[1]Sort Sheet'!AT76)","v":"Y"},{"$f":"IF('[1]Sort Sheet'!E76=0,\"\",'[1]Sort Sheet'!H76)","v":"Y"},{"$f":"IF('[1]Sort Sheet'!E76=0,\"\",'[1]Sort Sheet'!J76)","v":"Bremer Feedlot"},{"$f":"IF('[1]Sort Sheet'!E76=0,\"\",'[1]Sort Sheet'!L76)","v":"Angus "},{"$f":"IF('[1]Sort Sheet'!E76=0,\"\",'[1]Sort Sheet'!O76)","v":0},{"$f":"IF('[1]Sort Sheet'!P76=0,\"\",'[1]Sort Sheet'!P76)","v":265},{"$f":"IF('[1]Sort Sheet'!E76=0,\"\",'[1]Sort Sheet'!Q76)","v":11},{"$f":"IF('[1]Sort Sheet'!E76=0,\"\",'[1]Sort Sheet'!R76)","v":8},{"$f":"IF('[1]Sort Sheet'!E76=0,\"\",'[1]Sort Sheet'!S76)","v":69},{"$f":"IF('[1]Sort Sheet'!E76=0,\"\",'[1]Sort Sheet'!U76)","v":"2"},{"$f":"IF('[1]Sort Sheet'!E76=0,\"\",'[1]Sort Sheet'!V76)","v":1},{"$f":"IF('[1]Sort Sheet'!E76=0,\"\",'[1]Sort Sheet'!W76)","v":1},{"$f":"IF('[1]Sort Sheet'!E76=0,\"\",'[1]Sort Sheet'!X76)","v":5.65},{"$f":"IF('[1]Sort Sheet'!E76=0,\"\",'[1]Sort Sheet'!M76)","v":55.94},{"$f":"IF('[1]Sort Sheet'!E76=0,\"\",'[1]Sort Sheet'!Z76)","v":57.14},{"$f":"IF('[1]Sort Sheet'!E76=0,\"\",'[1]Sort Sheet'!AA76)","v":10.756676557863502},{"$f":"IF('[1]Sort Sheet'!E76=0,\"\",'[1]Sort Sheet'!AB76)","v":1628.7867210682493},{"$f":"IF('[1]Sort Sheet'!E76=0,\"\",'[1]Sort Sheet'!AC76)","v":6.1463649851632054},162.88,1791.6667210682494,6.7610064945971677]
[73,{"$f":"IF('[1]Sort Sheet'!D77=0,\"\",'[1]Sort Sheet'!D77)","v":244},{"$f":"IF('[1]Sort Sheet'!E77=0,\"\",'[1]Sort Sheet'!E77)","v":"334C"},{"$f":"IF('[1]Sort Sheet'!F77=0,\"\",'[1]Sort Sheet'!F77)","v":"F"},{"$f":"IF('[1]Sort Sheet'!E77=0,\"\",'[1]Sort Sheet'!AT77)","v":"Y"},{"$f":"IF('[1]Sort Sheet'!E77=0,\"\",'[1]Sort Sheet'!H77)","v":"Y"},{"$f":"IF('[1]Sort Sheet'!E77=0,\"\",'[1]Sort Sheet'!J77)","v":"John & Estelle  Drynan"},{"$f":"IF('[1]Sort Sheet'!E77=0,\"\",'[1]Sort Sheet'!L77)","v":"Charolais "},{"$f":"IF('[1]Sort Sheet'!E77=0,\"\",'[1]Sort Sheet'!O77)","v":0},{"$f":"IF('[1]Sort Sheet'!P77=0,\"\",'[1]Sort Sheet'!P77)","v":267.39999999999998},{"$f":"IF('[1]Sort Sheet'!E77=0,\"\",'[1]Sort Sheet'!Q77)","v":8},{"$f":"IF('[1]Sort Sheet'!E77=0,\"\",'[1]Sort Sheet'!R77)","v":5},{"$f":"IF('[1]Sort Sheet'!E77=0,\"\",'[1]Sort Sheet'!S77)","v":77},{"$f":"IF('[1]Sort Sheet'!E77=0,\"\",'[1]Sort Sheet'!U77)","v":"2"},{"$f":"IF('[1]Sort Sheet'!E77=0,\"\",'[1]Sort Sheet'!V77)","v":1},{"$f":"IF('[1]Sort Sheet'!E77=0,\"\",'[1]Sort Sheet'!W77)","v":1},{"$f":"IF('[1]Sort Sheet'!E77=0,\"\",'[1]Sort Sheet'!X77)","v":5.55},{"$f":"IF('[1]Sort Sheet'!E77=0,\"\",'[1]Sort Sheet'!M77)","v":60.99},{"$f":"IF('[1]Sort Sheet'!E77=0,\"\",'[1]Sort Sheet'!Z77)","v":57.1},{"$f":"IF('[1]Sort Sheet'!E77=0,\"\",'[1]Sort Sheet'!AA77)","v":10.756676557863502},{"$f":"IF('[1]Sort Sheet'!E77=0,\"\",'[1]Sort Sheet'!AB77)","v":1642.3874629080119},{"$f":"IF('[1]Sort Sheet'!E77=0,\"\",'[1]Sort Sheet'!AC77)","v":6.1420623145400599},164.24,1806.6274629080119,6.7562732345101422]
[74,{"$f":"IF('[1]Sort Sheet'!D78=0,\"\",'[1]Sort Sheet'!D78)","v":269},{"$f":"IF('[1]Sort Sheet'!E78=0,\"\",'[1]Sort Sheet'!E78)","v":"340C"},{"$f":"IF('[1]Sort Sheet'!F78=0,\"\",'[1]Sort Sheet'!F78)","v":"M"},{"$f":"IF('[1]Sort Sheet'!E78=0,\"\",'[1]Sort Sheet'!AT78)","v":"Y"},{"$f":"IF('[1]Sort Sheet'!E78=0,\"\",'[1]Sort Sheet'!H78)","v":"Y"},{"$f":"IF('[1]Sort Sheet'!E78=0,\"\",'[1]Sort Sheet'!J78)","v":"Smithfield Cattle Co"},{"$f":"IF('[1]Sort Sheet'!E78=0,\"\",'[1]Sort Sheet'!L78)","v":"Angus"},{"$f":"IF('[1]Sort Sheet'!E78=0,\"\",'[1]Sort Sheet'!O78)","v":0},{"$f":"IF('[1]Sort Sheet'!P78=0,\"\",'[1]Sort Sheet'!P78)","v":266.39999999999998},{"$f":"IF('[1]Sort Sheet'!E78=0,\"\",'[1]Sort Sheet'!Q78)","v":20},{"$f":"IF('[1]Sort Sheet'!E78=0,\"\",'[1]Sort Sheet'!R78)","v":9},{"$f":"IF('[1]Sort Sheet'!E78=0,\"\",'[1]Sort Sheet'!S78)","v":71},{"$f":"IF('[1]Sort Sheet'!E78=0,\"\",'[1]Sort Sheet'!U78)","v":"1b"},{"$f":"IF('[1]Sort Sheet'!E78=0,\"\",'[1]Sort Sheet'!V78)","v":1},{"$f":"IF('[1]Sort Sheet'!E78=0,\"\",'[1]Sort Sheet'!W78)","v":2},{"$f":"IF('[1]Sort Sheet'!E78=0,\"\",'[1]Sort Sheet'!X78)","v":5.47},{"$f":"IF('[1]Sort Sheet'!E78=0,\"\",'[1]Sort Sheet'!M78)","v":57.74},{"$f":"IF('[1]Sort Sheet'!E78=0,\"\",'[1]Sort Sheet'!Z78)","v":56.91},{"$f":"IF('[1]Sort Sheet'!E78=0,\"\",'[1]Sort Sheet'!AA78)","v":10.756676557863502},{"$f":"IF('[1]Sort Sheet'!E78=0,\"\",'[1]Sort Sheet'!AB78)","v":1630.8008011869433},{"$f":"IF('[1]Sort Sheet'!E78=0,\"\",'[1]Sort Sheet'!AC78)","v":6.1216246290801184},163.08000000000001,1793.8808011869432,6.73378679124228]
[75,{"$f":"IF('[1]Sort Sheet'!D79=0,\"\",'[1]Sort Sheet'!D79)","v":234},{"$f":"IF('[1]Sort Sheet'!E79=0,\"\",'[1]Sort Sheet'!E79)","v":"328A"},{"$f":"IF('[1]Sort Sheet'!F79=0,\"\",'[1]Sort Sheet'!F79)","v":"F"},{"$f":"IF('[1]Sort Sheet'!E79=0,\"\",'[1]Sort Sheet'!AT79)","v":"Y"},{"$f":"IF('[1]Sort Sheet'!E79=0,\"\",'[1]Sort Sheet'!H79)","v":"Y"},{"$f":"IF('[1]Sort Sheet'!E79=0,\"\",'[1]Sort Sheet'!J79)","v":"Juandah Grazing"},{"$f":"IF('[1]Sort Sheet'!E79=0,\"\",'[1]Sort Sheet'!L79)","v":"Charolais X Brangus"},{"$f":"IF('[1]Sort Sheet'!E79=0,\"\",'[1]Sort Sheet'!O79)","v":0},{"$f":"IF('[1]Sort Sheet'!P79=0,\"\",'[1]Sort Sheet'!P79)","v":310.8},{"$f":"IF('[1]Sort Sheet'!E79=0,\"\",'[1]Sort Sheet'!Q79)","v":11},{"$f":"IF('[1]Sort Sheet'!E79=0,\"\",'[1]Sort Sheet'!R79)","v":8},{"$f":"IF('[1]Sort Sheet'!E79=0,\"\",'[1]Sort Sheet'!S79)","v":96},{"$f":"IF('[1]Sort Sheet'!E79=0,\"\",'[1]Sort Sheet'!U79)","v":"2"},{"$f":"IF('[1]Sort Sheet'!E79=0,\"\",'[1]Sort Sheet'!V79)","v":1},{"$f":"IF('[1]Sort Sheet'!E79=0,\"\",'[1]Sort Sheet'!W79)","v":1},{"$f":"IF('[1]Sort Sheet'!E79=0,\"\",'[1]Sort Sheet'!X79)","v":5.55},{"$f":"IF('[1]Sort Sheet'!E79=0,\"\",'[1]Sort Sheet'!M79)","v":55.05},{"$f":"IF('[1]Sort Sheet'!E79=0,\"\",'[1]Sort Sheet'!Z79)","v":56.84},{"$f":"IF('[1]Sort Sheet'!E79=0,\"\",'[1]Sort Sheet'!AA79)","v":10.756676557863502},{"$f":"IF('[1]Sort Sheet'!E79=0,\"\",'[1]Sort Sheet'!AB79)","v":1900.2607121661724},{"$f":"IF('[1]Sort Sheet'!E79=0,\"\",'[1]Sort Sheet'!AC79)","v":6.1140949554896151},190.03,2090.2907121661724,6.7255170919117511]
[76,{"$f":"IF('[1]Sort Sheet'!D80=0,\"\",'[1]Sort Sheet'!D80)","v":276},{"$f":"IF('[1]Sort Sheet'!E80=0,\"\",'[1]Sort Sheet'!E80)","v":"343A"},{"$f":"IF('[1]Sort Sheet'!F80=0,\"\",'[1]Sort Sheet'!F80)","v":"F"},{"$f":"IF('[1]Sort Sheet'!E80=0,\"\",'[1]Sort Sheet'!AT80)","v":"Y"},{"$f":"IF('[1]Sort Sheet'!E80=0,\"\",'[1]Sort Sheet'!H80)","v":"Y"},{"$f":"IF('[1]Sort Sheet'!E80=0,\"\",'[1]Sort Sheet'!J80)","v":"Arubial Pty Ltd"},{"$f":"IF('[1]Sort Sheet'!E80=0,\"\",'[1]Sort Sheet'!L80)","v":"Angus X"},{"$f":"IF('[1]Sort Sheet'!E80=0,\"\",'[1]Sort Sheet'!O80)","v":0},{"$f":"IF('[1]Sort Sheet'!P80=0,\"\",'[1]Sort Sheet'!P80)","v":275.8},{"$f":"IF('[1]Sort Sheet'!E80=0,\"\",'[1]Sort Sheet'!Q80)","v":15},{"$f":"IF('[1]Sort Sheet'!E80=0,\"\",'[1]Sort Sheet'!R80)","v":9},{"$f":"IF('[1]Sort Sheet'!E80=0,\"\",'[1]Sort Sheet'!S80)","v":88},{"$f":"IF('[1]Sort Sheet'!E80=0,\"\",'[1]Sort Sheet'!U80)","v":"1b"},{"$f":"IF('[1]Sort Sheet'!E80=0,\"\",'[1]Sort Sheet'!V80)","v":0},{"$f":"IF('[1]Sort Sheet'!E80=0,\"\",'[1]Sort Sheet'!W80)","v":1},{"$f":"IF('[1]Sort Sheet'!E80=0,\"\",'[1]Sort Sheet'!X80)","v":5.47},{"$f":"IF('[1]Sort Sheet'!E80=0,\"\",'[1]Sort Sheet'!M80)","v":56.32},{"$f":"IF('[1]Sort Sheet'!E80=0,\"\",'[1]Sort Sheet'!Z80)","v":56.56},{"$f":"IF('[1]Sort Sheet'!E80=0,\"\",'[1]Sort Sheet'!AA80)","v":10.756676557863502},{"$f":"IF('[1]Sort Sheet'!E80=0,\"\",'[1]Sort Sheet'!AB80)","v":1677.9606528189913},{"$f":"IF('[1]Sort Sheet'!E80=0,\"\",'[1]Sort Sheet'!AC80)","v":6.0839762611275967},167.8,1845.7606528189913,6.6923881538034493]
[77,{"$f":"IF('[1]Sort Sheet'!D81=0,\"\",'[1]Sort Sheet'!D81)","v":241},{"$f":"IF('[1]Sort Sheet'!E81=0,\"\",'[1]Sort Sheet'!E81)","v":"335A"},{"$f":"IF('[1]Sort Sheet'!F81=0,\"\",'[1]Sort Sheet'!F81)","v":"F"},{"$f":"IF('[1]Sort Sheet'!E81=0,\"\",'[1]Sort Sheet'!AT81)","v":"Y"},{"$f":"IF('[1]Sort Sheet'!E81=0,\"\",'[1]Sort Sheet'!H81)","v":"Y"},{"$f":"IF('[1]Sort Sheet'!E81=0,\"\",'[1]Sort Sheet'!J81)","v":"Midge Thompson"},{"$f":"IF('[1]Sort Sheet'!E81=0,\"\",'[1]Sort Sheet'!L81)","v":"Limousin X"},{"$f":"IF('[1]Sort Sheet'!E81=0,\"\",'[1]Sort Sheet'!O81)","v":0},{"$f":"IF('[1]Sort Sheet'!P81=0,\"\",'[1]Sort Sheet'!P81)","v":302.39999999999998},{"$f":"IF('[1]Sort Sheet'!E81=0,\"\",'[1]Sort Sheet'!Q81)","v":20},{"$f":"IF('[1]Sort Sheet'!E81=0,\"\",'[1]Sort Sheet'!R81)","v":8},{"$f":"IF('[1]Sort Sheet'!E81=0,\"\",'[1]Sort Sheet'!S81)","v":92},{"$f":"IF('[1]Sort Sheet'!E81=0,\"\",'[1]Sort Sheet'!U81)","v":"2"},{"$f":"IF('[1]Sort Sheet'!E81=0,\"\",'[1]Sort Sheet'!V81)","v":2},{"$f":"IF('[1]Sort Sheet'!E81=0,\"\",'[1]Sort Sheet'!W81)","v":1},{"$f":"IF('[1]Sort Sheet'!E81=0,\"\",'[1]Sort Sheet'!X81)","v":5.6},{"$f":"IF('[1]Sort Sheet'!E81=0,\"\",'[1]Sort Sheet'!M81)","v":59.36},{"$f":"IF('[1]Sort Sheet'!E81=0,\"\",'[1]Sort Sheet'!Z81)","v":56.55},{"$f":"IF('[1]Sort Sheet'!E81=0,\"\",'[1]Sort Sheet'!AA81)","v":10.756676557863502},{"$f":"IF('[1]Sort Sheet'!E81=0,\"\",'[1]Sort Sheet'!AB81)","v":1839.4691394658751},{"$f":"IF('[1]Sort Sheet'!E81=0,\"\",'[1]Sort Sheet'!AC81)","v":6.0829005934718099},183.95,2023.4191394658751,6.6912008580220741]
[78,{"$f":"IF('[1]Sort Sheet'!D82=0,\"\",'[1]Sort Sheet'!D82)","v":275},{"$f":"IF('[1]Sort Sheet'!E82=0,\"\",'[1]Sort Sheet'!E82)","v":"345B"},{"$f":"IF('[1]Sort Sheet'!F82=0,\"\",'[1]Sort Sheet'!F82)","v":"F"},{"$f":"IF('[1]Sort Sheet'!E82=0,\"\",'[1]Sort Sheet'!AT82)","v":"Y"},{"$f":"IF('[1]Sort Sheet'!E82=0,\"\",'[1]Sort Sheet'!H82)","v":"Y"},{"$f":"IF('[1]Sort Sheet'!E82=0,\"\",'[1]Sort Sheet'!J82)","v":"Arubial Pty Ltd"},{"$f":"IF('[1]Sort Sheet'!E82=0,\"\",'[1]Sort Sheet'!L82)","v":"Santa X"},{"$f":"IF('[1]Sort Sheet'!E82=0,\"\",'[1]Sort Sheet'!O82)","v":0},{"$f":"IF('[1]Sort Sheet'!P82=0,\"\",'[1]Sort Sheet'!P82)","v":271.60000000000002},{"$f":"IF('[1]Sort Sheet'!E82=0,\"\",'[1]Sort Sheet'!Q82)","v":18},{"$f":"IF('[1]Sort Sheet'!E82=0,\"\",'[1]Sort Sheet'!R82)","v":4},{"$f":"IF('[1]Sort Sheet'!E82=0,\"\",'[1]Sort Sheet'!S82)","v":71},{"$f":"IF('[1]Sort Sheet'!E82=0,\"\",'[1]Sort Sheet'!U82)","v":"3"},{"$f":"IF('[1]Sort Sheet'!E82=0,\"\",'[1]Sort Sheet'!V82)","v":0},{"$f":"IF('[1]Sort Sheet'!E82=0,\"\",'[1]Sort Sheet'!W82)","v":1},{"$f":"IF('[1]Sort Sheet'!E82=0,\"\",'[1]Sort Sheet'!X82)","v":5.56},{"$f":"IF('[1]Sort Sheet'!E82=0,\"\",'[1]Sort Sheet'!M82)","v":54.08},{"$f":"IF('[1]Sort Sheet'!E82=0,\"\",'[1]Sort Sheet'!Z82)","v":56.55},{"$f":"IF('[1]Sort Sheet'!E82=0,\"\",'[1]Sort Sheet'!AA82)","v":10.756676557863502},{"$f":"IF('[1]Sort Sheet'!E82=0,\"\",'[1]Sort Sheet'!AB82)","v":1652.1158011869438},{"$f":"IF('[1]Sort Sheet'!E82=0,\"\",'[1]Sort Sheet'!AC82)","v":6.0829005934718108},165.21,1817.3258011869439,6.6911848350034751]
[79,{"$f":"IF('[1]Sort Sheet'!D83=0,\"\",'[1]Sort Sheet'!D83)","v":287},{"$f":"IF('[1]Sort Sheet'!E83=0,\"\",'[1]Sort Sheet'!E83)","v":"347B"},{"$f":"IF('[1]Sort Sheet'!F83=0,\"\",'[1]Sort Sheet'!F83)","v":"M"},{"$f":"IF('[1]Sort Sheet'!E83=0,\"\",'[1]Sort Sheet'!AT83)","v":"Y"},{"$f":"IF('[1]Sort Sheet'!E83=0,\"\",'[1]Sort Sheet'!H83)","v":"Y"},{"$f":"IF('[1]Sort Sheet'!E83=0,\"\",'[1]Sort Sheet'!J83)","v":"Bremer Feedlot"},{"$f":"IF('[1]Sort Sheet'!E83=0,\"\",'[1]Sort Sheet'!L83)","v":"Angus "},{"$f":"IF('[1]Sort Sheet'!E83=0,\"\",'[1]Sort Sheet'!O83)","v":0},{"$f":"IF('[1]Sort Sheet'!P83=0,\"\",'[1]Sort Sheet'!P83)","v":291.39999999999998},{"$f":"IF('[1]Sort Sheet'!E83=0,\"\",'[1]Sort Sheet'!Q83)","v":16},{"$f":"IF('[1]Sort Sheet'!E83=0,\"\",'[1]Sort Sheet'!R83)","v":9},{"$f":"IF('[1]Sort Sheet'!E83=0,\"\",'[1]Sort Sheet'!S83)","v":75},{"$f":"IF('[1]Sort Sheet'!E83=0,\"\",'[1]Sort Sheet'!U83)","v":"1b"},{"$f":"IF('[1]Sort Sheet'!E83=0,\"\",'[1]Sort Sheet'!V83)","v":1},{"$f":"IF('[1]Sort Sheet'!E83=0,\"\",'[1]Sort Sheet'!W83)","v":1},{"$f":"IF('[1]Sort Sheet'!E83=0,\"\",'[1]Sort Sheet'!X83)","v":5.53},{"$f":"IF('[1]Sort Sheet'!E83=0,\"\",'[1]Sort Sheet'!M83)","v":56.15},{"$f":"IF('[1]Sort Sheet'!E83=0,\"\",'[1]Sort Sheet'!Z83)","v":56.45},{"$f":"IF('[1]Sort Sheet'!E83=0,\"\",'[1]Sort Sheet'!AA83)","v":10.756676557863502},{"$f":"IF('[1]Sort Sheet'!E83=0,\"\",'[1]Sort Sheet'!AB83)","v":1769.422737388724},{"$f":"IF('[1]Sort Sheet'!E83=0,\"\",'[1]Sort Sheet'!AC83)","v":6.0721439169139471},176.94,1946.3627373887241,6.6793505057952105]
[80,{"$f":"IF('[1]Sort Sheet'!D84=0,\"\",'[1]Sort Sheet'!D84)","v":296},{"$f":"IF('[1]Sort Sheet'!E84=0,\"\",'[1]Sort Sheet'!E84)","v":"351B"},{"$f":"IF('[1]Sort Sheet'!F84=0,\"\",'[1]Sort Sheet'!F84)","v":"M"},{"$f":"IF('[1]Sort Sheet'!E84=0,\"\",'[1]Sort Sheet'!AT84)","v":"Y"},{"$f":"IF('[1]Sort Sheet'!E84=0,\"\",'[1]Sort Sheet'!H84)","v":"Y"},{"$f":"IF('[1]Sort Sheet'!E84=0,\"\",'[1]Sort Sheet'!J84)","v":"B Feeders Pty ltd"},{"$f":"IF('[1]Sort Sheet'!E84=0,\"\",'[1]Sort Sheet'!L84)","v":"Charolais X Santa"},{"$f":"IF('[1]Sort Sheet'!E84=0,\"\",'[1]Sort Sheet'!O84)","v":0},{"$f":"IF('[1]Sort Sheet'!P84=0,\"\",'[1]Sort Sheet'!P84)","v":278.39999999999998},{"$f":"IF('[1]Sort Sheet'!E84=0,\"\",'[1]Sort Sheet'!Q84)","v":12},{"$f":"IF('[1]Sort Sheet'!E84=0,\"\",'[1]Sort Sheet'!R84)","v":6},{"$f":"IF('[1]Sort Sheet'!E84=0,\"\",'[1]Sort Sheet'!S84)","v":62},{"$f":"IF('[1]Sort Sheet'!E84=0,\"\",'[1]Sort Sheet'!U84)","v":"1b"},{"$f":"IF('[1]Sort Sheet'!E84=0,\"\",'[1]Sort Sheet'!V84)","v":1},{"$f":"IF('[1]Sort Sheet'!E84=0,\"\",'[1]Sort Sheet'!W84)","v":1},{"$f":"IF('[1]Sort Sheet'!E84=0,\"\",'[1]Sort Sheet'!X84)","v":5.59},{"$f":"IF('[1]Sort Sheet'!E84=0,\"\",'[1]Sort Sheet'!M84)","v":53.21},{"$f":"IF('[1]Sort Sheet'!E84=0,\"\",'[1]Sort Sheet'!Z84)","v":56.44},{"$f":"IF('[1]Sort Sheet'!E84=0,\"\",'[1]Sort Sheet'!AA84)","v":10.756676557863502},{"$f":"IF('[1]Sort Sheet'!E84=0,\"\",'[1]Sort Sheet'!AB84)","v":1690.1854005934717},{"$f":"IF('[1]Sort Sheet'!E84=0,\"\",'[1]Sort Sheet'!AC84)","v":6.0710682492581602},169.02,1859.2054005934717,6.6781803182236779]
[81,{"$f":"IF('[1]Sort Sheet'!D85=0,\"\",'[1]Sort Sheet'!D85)","v":281},{"$f":"IF('[1]Sort Sheet'!E85=0,\"\",'[1]Sort Sheet'!E85)","v":"348B"},{"$f":"IF('[1]Sort Sheet'!F85=0,\"\",'[1]Sort Sheet'!F85)","v":"M"},{"$f":"IF('[1]Sort Sheet'!E85=0,\"\",'[1]Sort Sheet'!AT85)","v":"Y"},{"$f":"IF('[1]Sort Sheet'!E85=0,\"\",'[1]Sort Sheet'!H85)","v":"Y"},{"$f":"IF('[1]Sort Sheet'!E85=0,\"\",'[1]Sort Sheet'!J85)","v":"Bremer Feedlot"},{"$f":"IF('[1]Sort Sheet'!E85=0,\"\",'[1]Sort Sheet'!L85)","v":"Angus "},{"$f":"IF('[1]Sort Sheet'!E85=0,\"\",'[1]Sort Sheet'!O85)","v":0},{"$f":"IF('[1]Sort Sheet'!P85=0,\"\",'[1]Sort Sheet'!P85)","v":287.2},{"$f":"IF('[1]Sort Sheet'!E85=0,\"\",'[1]Sort Sheet'!Q85)","v":11},{"$f":"IF('[1]Sort Sheet'!E85=0,\"\",'[1]Sort Sheet'!R85)","v":10},{"$f":"IF('[1]Sort Sheet'!E85=0,\"\",'[1]Sort Sheet'!S85)","v":75},{"$f":"IF('[1]Sort Sheet'!E85=0,\"\",'[1]Sort Sheet'!U85)","v":"1b"},{"$f":"IF('[1]Sort Sheet'!E85=0,\"\",'[1]Sort Sheet'!V85)","v":0},{"$f":"IF('[1]Sort Sheet'!E85=0,\"\",'[1]Sort Sheet'!W85)","v":1},{"$f":"IF('[1]Sort Sheet'!E85=0,\"\",'[1]Sort Sheet'!X85)","v":5.4},{"$f":"IF('[1]Sort Sheet'!E85=0,\"\",'[1]Sort Sheet'!M85)","v":54.7},{"$f":"IF('[1]Sort Sheet'!E85=0,\"\",'[1]Sort Sheet'!Z85)","v":55.94},{"$f":"IF('[1]Sort Sheet'!E85=0,\"\",'[1]Sort Sheet'!AA85)","v":10.756676557863502},{"$f":"IF('[1]Sort Sheet'!E85=0,\"\",'[1]Sort Sheet'!AB85)","v":1728.1642136498515},{"$f":"IF('[1]Sort Sheet'!E85=0,\"\",'[1]Sort Sheet'!AC85)","v":6.0172848664688425},172.82,1900.9842136498514,6.6190258135440514]
[82,{"$f":"IF('[1]Sort Sheet'!D86=0,\"\",'[1]Sort Sheet'!D86)","v":216},{"$f":"IF('[1]Sort Sheet'!E86=0,\"\",'[1]Sort Sheet'!E86)","v":"327B"},{"$f":"IF('[1]Sort Sheet'!F86=0,\"\",'[1]Sort Sheet'!F86)","v":"F"},{"$f":"IF('[1]Sort Sheet'!E86=0,\"\",'[1]Sort Sheet'!AT86)","v":"Y"},{"$f":"IF('[1]Sort Sheet'!E86=0,\"\",'[1]Sort Sheet'!H86)","v":"Y"},{"$f":"IF('[1]Sort Sheet'!E86=0,\"\",'[1]Sort Sheet'!J86)","v":"D J & K L Hart"},{"$f":"IF('[1]Sort Sheet'!E86=0,\"\",'[1]Sort Sheet'!L86)","v":"Angus / Charolais X"},{"$f":"IF('[1]Sort Sheet'!E86=0,\"\",'[1]Sort Sheet'!O86)","v":0},{"$f":"IF('[1]Sort Sheet'!P86=0,\"\",'[1]Sort Sheet'!P86)","v":254.6},{"$f":"IF('[1]Sort Sheet'!E86=0,\"\",'[1]Sort Sheet'!Q86)","v":8},{"$f":"IF('[1]Sort Sheet'!E86=0,\"\",'[1]Sort Sheet'!R86)","v":5},{"$f":"IF('[1]Sort Sheet'!E86=0,\"\",'[1]Sort Sheet'!S86)","v":65},{"$f":"IF('[1]Sort Sheet'!E86=0,\"\",'[1]Sort Sheet'!U86)","v":"1b"},{"$f":"IF('[1]Sort Sheet'!E86=0,\"\",'[1]Sort Sheet'!V86)","v":2},{"$f":"IF('[1]Sort Sheet'!E86=0,\"\",'[1]Sort Sheet'!W86)","v":2},{"$f":"IF('[1]Sort Sheet'!E86=0,\"\",'[1]Sort Sheet'!X86)","v":5.41},{"$f":"IF('[1]Sort Sheet'!E86=0,\"\",'[1]Sort Sheet'!M86)","v":55.98},{"$f":"IF('[1]Sort Sheet'!E86=0,\"\",'[1]Sort Sheet'!Z86)","v":55.94},{"$f":"IF('[1]Sort Sheet'!E86=0,\"\",'[1]Sort Sheet'!AA86)","v":10.756676557863502},{"$f":"IF('[1]Sort Sheet'!E86=0,\"\",'[1]Sort Sheet'!AB86)","v":1532.0007270029673},{"$f":"IF('[1]Sort Sheet'!E86=0,\"\",'[1]Sort Sheet'!AC86)","v":6.0172848664688425},153.19999999999999,1685.2007270029674,6.6190130675686074]
[83,{"$f":"IF('[1]Sort Sheet'!D87=0,\"\",'[1]Sort Sheet'!D87)","v":271},{"$f":"IF('[1]Sort Sheet'!E87=0,\"\",'[1]Sort Sheet'!E87)","v":"345A"},{"$f":"IF('[1]Sort Sheet'!F87=0,\"\",'[1]Sort Sheet'!F87)","v":"F"},{"$f":"IF('[1]Sort Sheet'!E87=0,\"\",'[1]Sort Sheet'!AT87)","v":"Y"},{"$f":"IF('[1]Sort Sheet'!E87=0,\"\",'[1]Sort Sheet'!H87)","v":"Y"},{"$f":"IF('[1]Sort Sheet'!E87=0,\"\",'[1]Sort Sheet'!J87)","v":"Arubial Pty Ltd"},{"$f":"IF('[1]Sort Sheet'!E87=0,\"\",'[1]Sort Sheet'!L87)","v":"Santa X"},{"$f":"IF('[1]Sort Sheet'!E87=0,\"\",'[1]Sort Sheet'!O87)","v":0},{"$f":"IF('[1]Sort Sheet'!P87=0,\"\",'[1]Sort Sheet'!P87)","v":279},{"$f":"IF('[1]Sort Sheet'!E87=0,\"\",'[1]Sort Sheet'!Q87)","v":12},{"$f":"IF('[1]Sort Sheet'!E87=0,\"\",'[1]Sort Sheet'!R87)","v":9},{"$f":"IF('[1]Sort Sheet'!E87=0,\"\",'[1]Sort Sheet'!S87)","v":84},{"$f":"IF('[1]Sort Sheet'!E87=0,\"\",'[1]Sort Sheet'!U87)","v":"1b"},{"$f":"IF('[1]Sort Sheet'!E87=0,\"\",'[1]Sort Sheet'!V87)","v":0},{"$f":"IF('[1]Sort Sheet'!E87=0,\"\",'[1]Sort Sheet'!W87)","v":1},{"$f":"IF('[1]Sort Sheet'!E87=0,\"\",'[1]Sort Sheet'!X87)","v":5.43},{"$f":"IF('[1]Sort Sheet'!E87=0,\"\",'[1]Sort Sheet'!M87)","v":55.8},{"$f":"IF('[1]Sort Sheet'!E87=0,\"\",'[1]Sort Sheet'!Z87)","v":55.87},{"$f":"IF('[1]Sort Sheet'!E87=0,\"\",'[1]Sort Sheet'!AA87)","v":10.756676557863502},{"$f":"IF('[1]Sort Sheet'!E87=0,\"\",'[1]Sort Sheet'!AB87)","v":1676.7216988130563},{"$f":"IF('[1]Sort Sheet'!E87=0,\"\",'[1]Sort Sheet'!AC87)","v":6.0097551928783375},167.67,1844.3916988130563,6.6107229348138219]
[84,{"$f":"IF('[1]Sort Sheet'!D88=0,\"\",'[1]Sort Sheet'!D88)","v":273},{"$f":"IF('[1]Sort Sheet'!E88=0,\"\",'[1]Sort Sheet'!E88)","v":"343C"},{"$f":"IF('[1]Sort Sheet'!F88=0,\"\",'[1]Sort Sheet'!F88)","v":"F"},{"$f":"IF('[1]Sort Sheet'!E88=0,\"\",'[1]Sort Sheet'!AT88)","v":"Y"},{"$f":"IF('[1]Sort Sheet'!E88=0,\"\",'[1]Sort Sheet'!H88)","v":"Y"},{"$f":"IF('[1]Sort Sheet'!E88=0,\"\",'[1]Sort Sheet'!J88)","v":"Arubial Pty Ltd"},{"$f":"IF('[1]Sort Sheet'!E88=0,\"\",'[1]Sort Sheet'!L88)","v":"Angus X"},{"$f":"IF('[1]Sort Sheet'!E88=0,\"\",'[1]Sort Sheet'!O88)","v":0},{"$f":"IF('[1]Sort Sheet'!P88=0,\"\",'[1]Sort Sheet'!P88)","v":285.8},{"$f":"IF('[1]Sort Sheet'!E88=0,\"\",'[1]Sort Sheet'!Q88)","v":12},{"$f":"IF('[1]Sort Sheet'!E88=0,\"\",'[1]Sort Sheet'!R88)","v":7},{"$f":"IF('[1]Sort Sheet'!E88=0,\"\",'[1]Sort Sheet'!S88)","v":77},{"$f":"IF('[1]Sort Sheet'!E88=0,\"\",'[1]Sort Sheet'!U88)","v":"1b"},{"$f":"IF('[1]Sort Sheet'!E88=0,\"\",'[1]Sort Sheet'!V88)","v":2},{"$f":"IF('[1]Sort Sheet'!E88=0,\"\",'[1]Sort Sheet'!W88)","v":3},{"$f":"IF('[1]Sort Sheet'!E88=0,\"\",'[1]Sort Sheet'!X88)","v":5.46},{"$f":"IF('[1]Sort Sheet'!E88=0,\"\",'[1]Sort Sheet'!M88)","v":56.75},{"$f":"IF('[1]Sort Sheet'!E88=0,\"\",'[1]Sort Sheet'!Z88)","v":55.32},{"$f":"IF('[1]Sort Sheet'!E88=0,\"\",'[1]Sort Sheet'!AA88)","v":10.756676557863502},{"$f":"IF('[1]Sort Sheet'!E88=0,\"\",'[1]Sort Sheet'!AB88)","v":1700.6796142433234},{"$f":"IF('[1]Sort Sheet'!E88=0,\"\",'[1]Sort Sheet'!AC88)","v":5.9505934718100884},170.07,1870.7496142433233,6.5456599518660719]
[85,{"$f":"IF('[1]Sort Sheet'!D89=0,\"\",'[1]Sort Sheet'!D89)","v":218},{"$f":"IF('[1]Sort Sheet'!E89=0,\"\",'[1]Sort Sheet'!E89)","v":"324C"},{"$f":"IF('[1]Sort Sheet'!F89=0,\"\",'[1]Sort Sheet'!F89)","v":"F"},{"$f":"IF('[1]Sort Sheet'!E89=0,\"\",'[1]Sort Sheet'!AT89)","v":"Y"},{"$f":"IF('[1]Sort Sheet'!E89=0,\"\",'[1]Sort Sheet'!H89)","v":"Y"},{"$f":"IF('[1]Sort Sheet'!E89=0,\"\",'[1]Sort Sheet'!J89)","v":"R S & K M  Stevens Family Trust "},{"$f":"IF('[1]Sort Sheet'!E89=0,\"\",'[1]Sort Sheet'!L89)","v":"Charolais X Santa"},{"$f":"IF('[1]Sort Sheet'!E89=0,\"\",'[1]Sort Sheet'!O89)","v":0},{"$f":"IF('[1]Sort Sheet'!P89=0,\"\",'[1]Sort Sheet'!P89)","v":269.2},{"$f":"IF('[1]Sort Sheet'!E89=0,\"\",'[1]Sort Sheet'!Q89)","v":10},{"$f":"IF('[1]Sort Sheet'!E89=0,\"\",'[1]Sort Sheet'!R89)","v":10},{"$f":"IF('[1]Sort Sheet'!E89=0,\"\",'[1]Sort Sheet'!S89)","v":80},{"$f":"IF('[1]Sort Sheet'!E89=0,\"\",'[1]Sort Sheet'!U89)","v":"1b"},{"$f":"IF('[1]Sort Sheet'!E89=0,\"\",'[1]Sort Sheet'!V89)","v":1},{"$f":"IF('[1]Sort Sheet'!E89=0,\"\",'[1]Sort Sheet'!W89)","v":1},{"$f":"IF('[1]Sort Sheet'!E89=0,\"\",'[1]Sort Sheet'!X89)","v":5.47},{"$f":"IF('[1]Sort Sheet'!E89=0,\"\",'[1]Sort Sheet'!M89)","v":57.01},{"$f":"IF('[1]Sort Sheet'!E89=0,\"\",'[1]Sort Sheet'!Z89)","v":55.14},{"$f":"IF('[1]Sort Sheet'!E89=0,\"\",'[1]Sort Sheet'!AA89)","v":10.756676557863502},{"$f":"IF('[1]Sort Sheet'!E89=0,\"\",'[1]Sort Sheet'!AB89)","v":1596.6875074183977},{"$f":"IF('[1]Sort Sheet'!E89=0,\"\",'[1]Sort Sheet'!AC89)","v":5.9312314540059354},159.66999999999999,1756.3575074183977,6.524359240038625]
[86,{"$f":"IF('[1]Sort Sheet'!D90=0,\"\",'[1]Sort Sheet'!D90)","v":284},{"$f":"IF('[1]Sort Sheet'!E90=0,\"\",'[1]Sort Sheet'!E90)","v":"347A"},{"$f":"IF('[1]Sort Sheet'!F90=0,\"\",'[1]Sort Sheet'!F90)","v":"M"},{"$f":"IF('[1]Sort Sheet'!E90=0,\"\",'[1]Sort Sheet'!AT90)","v":"Y"},{"$f":"IF('[1]Sort Sheet'!E90=0,\"\",'[1]Sort Sheet'!H90)","v":"Y"},{"$f":"IF('[1]Sort Sheet'!E90=0,\"\",'[1]Sort Sheet'!J90)","v":"Bremer Feedlot"},{"$f":"IF('[1]Sort Sheet'!E90=0,\"\",'[1]Sort Sheet'!L90)","v":"Angus "},{"$f":"IF('[1]Sort Sheet'!E90=0,\"\",'[1]Sort Sheet'!O90)","v":0},{"$f":"IF('[1]Sort Sheet'!P90=0,\"\",'[1]Sort Sheet'!P90)","v":307.39999999999998},{"$f":"IF('[1]Sort Sheet'!E90=0,\"\",'[1]Sort Sheet'!Q90)","v":20},{"$f":"IF('[1]Sort Sheet'!E90=0,\"\",'[1]Sort Sheet'!R90)","v":11},{"$f":"IF('[1]Sort Sheet'!E90=0,\"\",'[1]Sort Sheet'!S90)","v":78},{"$f":"IF('[1]Sort Sheet'!E90=0,\"\",'[1]Sort Sheet'!U90)","v":"2"},{"$f":"IF('[1]Sort Sheet'!E90=0,\"\",'[1]Sort Sheet'!V90)","v":2},{"$f":"IF('[1]Sort Sheet'!E90=0,\"\",'[1]Sort Sheet'!W90)","v":1},{"$f":"IF('[1]Sort Sheet'!E90=0,\"\",'[1]Sort Sheet'!X90)","v":5.63},{"$f":"IF('[1]Sort Sheet'!E90=0,\"\",'[1]Sort Sheet'!M90)","v":56.53},{"$f":"IF('[1]Sort Sheet'!E90=0,\"\",'[1]Sort Sheet'!Z90)","v":55.04},{"$f":"IF('[1]Sort Sheet'!E90=0,\"\",'[1]Sort Sheet'!AA90)","v":10.756676557863502},{"$f":"IF('[1]Sort Sheet'!E90=0,\"\",'[1]Sort Sheet'!AB90)","v":1819.9539465875371},{"$f":"IF('[1]Sort Sheet'!E90=0,\"\",'[1]Sort Sheet'!AC90)","v":5.9204747774480717},182,2001.9539465875371,6.512537236784441]
[87,{"$f":"IF('[1]Sort Sheet'!D91=0,\"\",'[1]Sort Sheet'!D91)","v":268},{"$f":"IF('[1]Sort Sheet'!E91=0,\"\",'[1]Sort Sheet'!E91)","v":"340B"},{"$f":"IF('[1]Sort Sheet'!F91=0,\"\",'[1]Sort Sheet'!F91)","v":"M"},{"$f":"IF('[1]Sort Sheet'!E91=0,\"\",'[1]Sort Sheet'!AT91)","v":"Y"},{"$f":"IF('[1]Sort Sheet'!E91=0,\"\",'[1]Sort Sheet'!H91)","v":"Y"},{"$f":"IF('[1]Sort Sheet'!E91=0,\"\",'[1]Sort Sheet'!J91)","v":"Smithfield Cattle Co"},{"$f":"IF('[1]Sort Sheet'!E91=0,\"\",'[1]Sort Sheet'!L91)","v":"Angus"},{"$f":"IF('[1]Sort Sheet'!E91=0,\"\",'[1]Sort Sheet'!O91)","v":0},{"$f":"IF('[1]Sort Sheet'!P91=0,\"\",'[1]Sort Sheet'!P91)","v":290.8},{"$f":"IF('[1]Sort Sheet'!E91=0,\"\",'[1]Sort Sheet'!Q91)","v":11},{"$f":"IF('[1]Sort Sheet'!E91=0,\"\",'[1]Sort Sheet'!R91)","v":12},{"$f":"IF('[1]Sort Sheet'!E91=0,\"\",'[1]Sort Sheet'!S91)","v":75},{"$f":"IF('[1]Sort Sheet'!E91=0,\"\",'[1]Sort Sheet'!U91)","v":"2"},{"$f":"IF('[1]Sort Sheet'!E91=0,\"\",'[1]Sort Sheet'!V91)","v":0},{"$f":"IF('[1]Sort Sheet'!E91=0,\"\",'[1]Sort Sheet'!W91)","v":1},{"$f":"IF('[1]Sort Sheet'!E91=0,\"\",'[1]Sort Sheet'!X91)","v":5.55},{"$f":"IF('[1]Sort Sheet'!E91=0,\"\",'[1]Sort Sheet'!M91)","v":57.33},{"$f":"IF('[1]Sort Sheet'!E91=0,\"\",'[1]Sort Sheet'!Z91)","v":54.96},{"$f":"IF('[1]Sort Sheet'!E91=0,\"\",'[1]Sort Sheet'!AA91)","v":10.756676557863502},{"$f":"IF('[1]Sort Sheet'!E91=0,\"\",'[1]Sort Sheet'!AB91)","v":1719.1716320474777},{"$f":"IF('[1]Sort Sheet'!E91=0,\"\",'[1]Sort Sheet'!AC91)","v":5.9118694362017798},171.92,1891.0916320474778,6.5030661349638157]
[88,{"$f":"IF('[1]Sort Sheet'!D92=0,\"\",'[1]Sort Sheet'!D92)","v":277},{"$f":"IF('[1]Sort Sheet'!E92=0,\"\",'[1]Sort Sheet'!E92)","v":"344A"},{"$f":"IF('[1]Sort Sheet'!F92=0,\"\",'[1]Sort Sheet'!F92)","v":"F"},{"$f":"IF('[1]Sort Sheet'!E92=0,\"\",'[1]Sort Sheet'!AT92)","v":"Y"},{"$f":"IF('[1]Sort Sheet'!E92=0,\"\",'[1]Sort Sheet'!H92)","v":"Y"},{"$f":"IF('[1]Sort Sheet'!E92=0,\"\",'[1]Sort Sheet'!J92)","v":"Arubial Pty Ltd"},{"$f":"IF('[1]Sort Sheet'!E92=0,\"\",'[1]Sort Sheet'!L92)","v":"Charolais X"},{"$f":"IF('[1]Sort Sheet'!E92=0,\"\",'[1]Sort Sheet'!O92)","v":0},{"$f":"IF('[1]Sort Sheet'!P92=0,\"\",'[1]Sort Sheet'!P92)","v":270.60000000000002},{"$f":"IF('[1]Sort Sheet'!E92=0,\"\",'[1]Sort Sheet'!Q92)","v":18},{"$f":"IF('[1]Sort Sheet'!E92=0,\"\",'[1]Sort Sheet'!R92)","v":8},{"$f":"IF('[1]Sort Sheet'!E92=0,\"\",'[1]Sort Sheet'!S92)","v":73},{"$f":"IF('[1]Sort Sheet'!E92=0,\"\",'[1]Sort Sheet'!U92)","v":"1b"},{"$f":"IF('[1]Sort Sheet'!E92=0,\"\",'[1]Sort Sheet'!V92)","v":0},{"$f":"IF('[1]Sort Sheet'!E92=0,\"\",'[1]Sort Sheet'!W92)","v":1},{"$f":"IF('[1]Sort Sheet'!E92=0,\"\",'[1]Sort Sheet'!X92)","v":5.54},{"$f":"IF('[1]Sort Sheet'!E92=0,\"\",'[1]Sort Sheet'!M92)","v":56.27},{"$f":"IF('[1]Sort Sheet'!E92=0,\"\",'[1]Sort Sheet'!Z92)","v":54.85},{"$f":"IF('[1]Sort Sheet'!E92=0,\"\",'[1]Sort Sheet'!AA92)","v":10.756676557863502},{"$f":"IF('[1]Sort Sheet'!E92=0,\"\",'[1]Sort Sheet'!AB92)","v":1596.5500370919885},{"$f":"IF('[1]Sort Sheet'!E92=0,\"\",'[1]Sort Sheet'!AC92)","v":5.900037091988132},159.66,1756.2100370919886,6.490059264937134]
[89,{"$f":"IF('[1]Sort Sheet'!D93=0,\"\",'[1]Sort Sheet'!D93)","v":274},{"$f":"IF('[1]Sort Sheet'!E93=0,\"\",'[1]Sort Sheet'!E93)","v":"344B"},{"$f":"IF('[1]Sort Sheet'!F93=0,\"\",'[1]Sort Sheet'!F93)","v":"F"},{"$f":"IF('[1]Sort Sheet'!E93=0,\"\",'[1]Sort Sheet'!AT93)","v":"Y"},{"$f":"IF('[1]Sort Sheet'!E93=0,\"\",'[1]Sort Sheet'!H93)","v":"Y"},{"$f":"IF('[1]Sort Sheet'!E93=0,\"\",'[1]Sort Sheet'!J93)","v":"Arubial Pty Ltd"},{"$f":"IF('[1]Sort Sheet'!E93=0,\"\",'[1]Sort Sheet'!L93)","v":"Charolais X"},{"$f":"IF('[1]Sort Sheet'!E93=0,\"\",'[1]Sort Sheet'!O93)","v":0},{"$f":"IF('[1]Sort Sheet'!P93=0,\"\",'[1]Sort Sheet'!P93)","v":300},{"$f":"IF('[1]Sort Sheet'!E93=0,\"\",'[1]Sort Sheet'!Q93)","v":20},{"$f":"IF('[1]Sort Sheet'!E93=0,\"\",'[1]Sort Sheet'!R93)","v":9},{"$f":"IF('[1]Sort Sheet'!E93=0,\"\",'[1]Sort Sheet'!S93)","v":80},{"$f":"IF('[1]Sort Sheet'!E93=0,\"\",'[1]Sort Sheet'!U93)","v":"1b"},{"$f":"IF('[1]Sort Sheet'!E93=0,\"\",'[1]Sort Sheet'!V93)","v":0},{"$f":"IF('[1]Sort Sheet'!E93=0,\"\",'[1]Sort Sheet'!W93)","v":1},{"$f":"IF('[1]Sort Sheet'!E93=0,\"\",'[1]Sort Sheet'!X93)","v":5.54},{"$f":"IF('[1]Sort Sheet'!E93=0,\"\",'[1]Sort Sheet'!M93)","v":56.59},{"$f":"IF('[1]Sort Sheet'!E93=0,\"\",'[1]Sort Sheet'!Z93)","v":54.12},{"$f":"IF('[1]Sort Sheet'!E93=0,\"\",'[1]Sort Sheet'!AA93)","v":10.756676557863502},{"$f":"IF('[1]Sort Sheet'!E93=0,\"\",'[1]Sort Sheet'!AB93)","v":1746.454005934718},{"$f":"IF('[1]Sort Sheet'!E93=0,\"\",'[1]Sort Sheet'!AC93)","v":5.8215133531157264},174.65,1921.1040059347181,6.403680019782394]
[90,{"$f":"IF('[1]Sort Sheet'!D94=0,\"\",'[1]Sort Sheet'!D94)","v":272},{"$f":"IF('[1]Sort Sheet'!E94=0,\"\",'[1]Sort Sheet'!E94)","v":"343B"},{"$f":"IF('[1]Sort Sheet'!F94=0,\"\",'[1]Sort Sheet'!F94)","v":"F"},{"$f":"IF('[1]Sort Sheet'!E94=0,\"\",'[1]Sort Sheet'!AT94)","v":"Y"},{"$f":"IF('[1]Sort Sheet'!E94=0,\"\",'[1]Sort Sheet'!H94)","v":"Y"},{"$f":"IF('[1]Sort Sheet'!E94=0,\"\",'[1]Sort Sheet'!J94)","v":"Arubial Pty Ltd"},{"$f":"IF('[1]Sort Sheet'!E94=0,\"\",'[1]Sort Sheet'!L94)","v":"Angus X"},{"$f":"IF('[1]Sort Sheet'!E94=0,\"\",'[1]Sort Sheet'!O94)","v":0},{"$f":"IF('[1]Sort Sheet'!P94=0,\"\",'[1]Sort Sheet'!P94)","v":274.2},{"$f":"IF('[1]Sort Sheet'!E94=0,\"\",'[1]Sort Sheet'!Q94)","v":18},{"$f":"IF('[1]Sort Sheet'!E94=0,\"\",'[1]Sort Sheet'!R94)","v":11},{"$f":"IF('[1]Sort Sheet'!E94=0,\"\",'[1]Sort Sheet'!S94)","v":75},{"$f":"IF('[1]Sort Sheet'!E94=0,\"\",'[1]Sort Sheet'!U94)","v":"2"},{"$f":"IF('[1]Sort Sheet'!E94=0,\"\",'[1]Sort Sheet'!V94)","v":1},{"$f":"IF('[1]Sort Sheet'!E94=0,\"\",'[1]Sort Sheet'!W94)","v":1},{"$f":"IF('[1]Sort Sheet'!E94=0,\"\",'[1]Sort Sheet'!X94)","v":5.46},{"$f":"IF('[1]Sort Sheet'!E94=0,\"\",'[1]Sort Sheet'!M94)","v":54.01},{"$f":"IF('[1]Sort Sheet'!E94=0,\"\",'[1]Sort Sheet'!Z94)","v":53.51},{"$f":"IF('[1]Sort Sheet'!E94=0,\"\",'[1]Sort Sheet'!AA94)","v":10.756676557863502},{"$f":"IF('[1]Sort Sheet'!E94=0,\"\",'[1]Sort Sheet'!AB94)","v":1578.2671290801186},{"$f":"IF('[1]Sort Sheet'!E94=0,\"\",'[1]Sort Sheet'!AC94)","v":5.7558976261127599},157.83000000000001,1736.0971290801185,6.3314993766598056]
[91,{"$f":"IF('[1]Sort Sheet'!D95=0,\"\",'[1]Sort Sheet'!D95)","v":279},{"$f":"IF('[1]Sort Sheet'!E95=0,\"\",'[1]Sort Sheet'!E95)","v":"344C"},{"$f":"IF('[1]Sort Sheet'!F95=0,\"\",'[1]Sort Sheet'!F95)","v":"F"},{"$f":"IF('[1]Sort Sheet'!E95=0,\"\",'[1]Sort Sheet'!AT95)","v":"Y"},{"$f":"IF('[1]Sort Sheet'!E95=0,\"\",'[1]Sort Sheet'!H95)","v":"Y"},{"$f":"IF('[1]Sort Sheet'!E95=0,\"\",'[1]Sort Sheet'!J95)","v":"Arubial Pty Ltd"},{"$f":"IF('[1]Sort Sheet'!E95=0,\"\",'[1]Sort Sheet'!L95)","v":"Charolais X"},{"$f":"IF('[1]Sort Sheet'!E95=0,\"\",'[1]Sort Sheet'!O95)","v":0},{"$f":"IF('[1]Sort Sheet'!P95=0,\"\",'[1]Sort Sheet'!P95)","v":268.8},{"$f":"IF('[1]Sort Sheet'!E95=0,\"\",'[1]Sort Sheet'!Q95)","v":12},{"$f":"IF('[1]Sort Sheet'!E95=0,\"\",'[1]Sort Sheet'!R95)","v":9},{"$f":"IF('[1]Sort Sheet'!E95=0,\"\",'[1]Sort Sheet'!S95)","v":65},{"$f":"IF('[1]Sort Sheet'!E95=0,\"\",'[1]Sort Sheet'!U95)","v":"3"},{"$f":"IF('[1]Sort Sheet'!E95=0,\"\",'[1]Sort Sheet'!V95)","v":0},{"$f":"IF('[1]Sort Sheet'!E95=0,\"\",'[1]Sort Sheet'!W95)","v":1},{"$f":"IF('[1]Sort Sheet'!E95=0,\"\",'[1]Sort Sheet'!X95)","v":5.53},{"$f":"IF('[1]Sort Sheet'!E95=0,\"\",'[1]Sort Sheet'!M95)","v":56.83},{"$f":"IF('[1]Sort Sheet'!E95=0,\"\",'[1]Sort Sheet'!Z95)","v":53.11},{"$f":"IF('[1]Sort Sheet'!E95=0,\"\",'[1]Sort Sheet'!AA95)","v":10.756676557863502},{"$f":"IF('[1]Sort Sheet'!E95=0,\"\",'[1]Sort Sheet'!AB95)","v":1535.6197032640951},{"$f":"IF('[1]Sort Sheet'!E95=0,\"\",'[1]Sort Sheet'!AC95)","v":5.7128709198813059},153.56,1689.179703264095,6.2841506817860671]
[92,{"$f":"IF('[1]Sort Sheet'!D96=0,\"\",'[1]Sort Sheet'!D96)","v":243},{"$f":"IF('[1]Sort Sheet'!E96=0,\"\",'[1]Sort Sheet'!E96)","v":"335C"},{"$f":"IF('[1]Sort Sheet'!F96=0,\"\",'[1]Sort Sheet'!F96)","v":"F"},{"$f":"IF('[1]Sort Sheet'!E96=0,\"\",'[1]Sort Sheet'!AT96)","v":"Y"},{"$f":"IF('[1]Sort Sheet'!E96=0,\"\",'[1]Sort Sheet'!H96)","v":"Y"},{"$f":"IF('[1]Sort Sheet'!E96=0,\"\",'[1]Sort Sheet'!J96)","v":"Midge Thompson"},{"$f":"IF('[1]Sort Sheet'!E96=0,\"\",'[1]Sort Sheet'!L96)","v":"Charolais X"},{"$f":"IF('[1]Sort Sheet'!E96=0,\"\",'[1]Sort Sheet'!O96)","v":0},{"$f":"IF('[1]Sort Sheet'!P96=0,\"\",'[1]Sort Sheet'!P96)","v":277.8},{"$f":"IF('[1]Sort Sheet'!E96=0,\"\",'[1]Sort Sheet'!Q96)","v":11},{"$f":"IF('[1]Sort Sheet'!E96=0,\"\",'[1]Sort Sheet'!R96)","v":10},{"$f":"IF('[1]Sort Sheet'!E96=0,\"\",'[1]Sort Sheet'!S96)","v":71},{"$f":"IF('[1]Sort Sheet'!E96=0,\"\",'[1]Sort Sheet'!U96)","v":"1b"},{"$f":"IF('[1]Sort Sheet'!E96=0,\"\",'[1]Sort Sheet'!V96)","v":1},{"$f":"IF('[1]Sort Sheet'!E96=0,\"\",'[1]Sort Sheet'!W96)","v":1},{"$f":"IF('[1]Sort Sheet'!E96=0,\"\",'[1]Sort Sheet'!X96)","v":5.37},{"$f":"IF('[1]Sort Sheet'!E96=0,\"\",'[1]Sort Sheet'!M96)","v":59.9},{"$f":"IF('[1]Sort Sheet'!E96=0,\"\",'[1]Sort Sheet'!Z96)","v":52.98},{"$f":"IF('[1]Sort Sheet'!E96=0,\"\",'[1]Sort Sheet'!AA96)","v":10.756676557863502},{"$f":"IF('[1]Sort Sheet'!E96=0,\"\",'[1]Sort Sheet'!AB96)","v":1583.1508753709197},{"$f":"IF('[1]Sort Sheet'!E96=0,\"\",'[1]Sort Sheet'!AC96)","v":5.6988872403560826},158.32,1741.4708753709197,6.2687936478434834]
[93,{"$f":"IF('[1]Sort Sheet'!D97=0,\"\",'[1]Sort Sheet'!D97)","v":247},{"$f":"IF('[1]Sort Sheet'!E97=0,\"\",'[1]Sort Sheet'!E97)","v":"333A"},{"$f":"IF('[1]Sort Sheet'!F97=0,\"\",'[1]Sort Sheet'!F97)","v":"F"},{"$f":"IF('[1]Sort Sheet'!E97=0,\"\",'[1]Sort Sheet'!AT97)","v":"Y"},{"$f":"IF('[1]Sort Sheet'!E97=0,\"\",'[1]Sort Sheet'!H97)","v":"Y"},{"$f":"IF('[1]Sort Sheet'!E97=0,\"\",'[1]Sort Sheet'!J97)","v":"John & Estelle  Drynan"},{"$f":"IF('[1]Sort Sheet'!E97=0,\"\",'[1]Sort Sheet'!L97)","v":"Charolais "},{"$f":"IF('[1]Sort Sheet'!E97=0,\"\",'[1]Sort Sheet'!O97)","v":0},{"$f":"IF('[1]Sort Sheet'!P97=0,\"\",'[1]Sort Sheet'!P97)","v":245},{"$f":"IF('[1]Sort Sheet'!E97=0,\"\",'[1]Sort Sheet'!Q97)","v":16},{"$f":"IF('[1]Sort Sheet'!E97=0,\"\",'[1]Sort Sheet'!R97)","v":15},{"$f":"IF('[1]Sort Sheet'!E97=0,\"\",'[1]Sort Sheet'!S97)","v":75},{"$f":"IF('[1]Sort Sheet'!E97=0,\"\",'[1]Sort Sheet'!U97)","v":"1b"},{"$f":"IF('[1]Sort Sheet'!E97=0,\"\",'[1]Sort Sheet'!V97)","v":1},{"$f":"IF('[1]Sort Sheet'!E97=0,\"\",'[1]Sort Sheet'!W97)","v":2},{"$f":"IF('[1]Sort Sheet'!E97=0,\"\",'[1]Sort Sheet'!X97)","v":5.45},{"$f":"IF('[1]Sort Sheet'!E97=0,\"\",'[1]Sort Sheet'!M97)","v":63.44},{"$f":"IF('[1]Sort Sheet'!E97=0,\"\",'[1]Sort Sheet'!Z97)","v":52.87},{"$f":"IF('[1]Sort Sheet'!E97=0,\"\",'[1]Sort Sheet'!AA97)","v":10.756676557863502},{"$f":"IF('[1]Sort Sheet'!E97=0,\"\",'[1]Sort Sheet'!AB97)","v":1393.3284495548962},{"$f":"IF('[1]Sort Sheet'!E97=0,\"\",'[1]Sort Sheet'!AC97)","v":5.6870548961424339},139.33000000000001,1532.6584495548962,6.2557487736934538]
[94,{"$f":"IF('[1]Sort Sheet'!D98=0,\"\",'[1]Sort Sheet'!D98)","v":282},{"$f":"IF('[1]Sort Sheet'!E98=0,\"\",'[1]Sort Sheet'!E98)","v":"348A"},{"$f":"IF('[1]Sort Sheet'!F98=0,\"\",'[1]Sort Sheet'!F98)","v":"M"},{"$f":"IF('[1]Sort Sheet'!E98=0,\"\",'[1]Sort Sheet'!AT98)","v":"Y"},{"$f":"IF('[1]Sort Sheet'!E98=0,\"\",'[1]Sort Sheet'!H98)","v":"Y"},{"$f":"IF('[1]Sort Sheet'!E98=0,\"\",'[1]Sort Sheet'!J98)","v":"Bremer Feedlot"},{"$f":"IF('[1]Sort Sheet'!E98=0,\"\",'[1]Sort Sheet'!L98)","v":"Angus "},{"$f":"IF('[1]Sort Sheet'!E98=0,\"\",'[1]Sort Sheet'!O98)","v":0},{"$f":"IF('[1]Sort Sheet'!P98=0,\"\",'[1]Sort Sheet'!P98)","v":309},{"$f":"IF('[1]Sort Sheet'!E98=0,\"\",'[1]Sort Sheet'!Q98)","v":25},{"$f":"IF('[1]Sort Sheet'!E98=0,\"\",'[1]Sort Sheet'!R98)","v":13},{"$f":"IF('[1]Sort Sheet'!E98=0,\"\",'[1]Sort Sheet'!S98)","v":68},{"$f":"IF('[1]Sort Sheet'!E98=0,\"\",'[1]Sort Sheet'!U98)","v":"1b"},{"$f":"IF('[1]Sort Sheet'!E98=0,\"\",'[1]Sort Sheet'!V98)","v":0},{"$f":"IF('[1]Sort Sheet'!E98=0,\"\",'[1]Sort Sheet'!W98)","v":2},{"$f":"IF('[1]Sort Sheet'!E98=0,\"\",'[1]Sort Sheet'!X98)","v":5.54},{"$f":"IF('[1]Sort Sheet'!E98=0,\"\",'[1]Sort Sheet'!M98)","v":57.65},{"$f":"IF('[1]Sort Sheet'!E98=0,\"\",'[1]Sort Sheet'!Z98)","v":52.59},{"$f":"IF('[1]Sort Sheet'!E98=0,\"\",'[1]Sort Sheet'!AA98)","v":10.756676557863502},{"$f":"IF('[1]Sort Sheet'!E98=0,\"\",'[1]Sort Sheet'!AB98)","v":1747.9932863501485},{"$f":"IF('[1]Sort Sheet'!E98=0,\"\",'[1]Sort Sheet'!AC98)","v":5.6569362017804163},174.8,1922.7932863501485,6.2226319946606745]
[95,{"$f":"IF('[1]Sort Sheet'!D99=0,\"\",'[1]Sort Sheet'!D99)","v":260},{"$f":"IF('[1]Sort Sheet'!E99=0,\"\",'[1]Sort Sheet'!E99)","v":"337C"},{"$f":"IF('[1]Sort Sheet'!F99=0,\"\",'[1]Sort Sheet'!F99)","v":"F"},{"$f":"IF('[1]Sort Sheet'!E99=0,\"\",'[1]Sort Sheet'!AT99)","v":"N"},{"$f":"IF('[1]Sort Sheet'!E99=0,\"\",'[1]Sort Sheet'!H99)","v":"N"},{"$f":"IF('[1]Sort Sheet'!E99=0,\"\",'[1]Sort Sheet'!J99)","v":"RB & VA Budd & Willoise Grazing Co Pty Ltd"},{"$f":"IF('[1]Sort Sheet'!E99=0,\"\",'[1]Sort Sheet'!L99)","v":"Charolais X"},{"$f":"IF('[1]Sort Sheet'!E99=0,\"\",'[1]Sort Sheet'!O99)","v":0},{"$f":"IF('[1]Sort Sheet'!P99=0,\"\",'[1]Sort Sheet'!P99)","v":221.6},{"$f":"IF('[1]Sort Sheet'!E99=0,\"\",'[1]Sort Sheet'!Q99)","v":6},{"$f":"IF('[1]Sort Sheet'!E99=0,\"\",'[1]Sort Sheet'!R99)","v":2},{"$f":"IF('[1]Sort Sheet'!E99=0,\"\",'[1]Sort Sheet'!S99)","v":88},{"$f":"IF('[1]Sort Sheet'!E99=0,\"\",'[1]Sort Sheet'!U99)","v":"1b"},{"$f":"IF('[1]Sort Sheet'!E99=0,\"\",'[1]Sort Sheet'!V99)","v":1},{"$f":"IF('[1]Sort Sheet'!E99=0,\"\",'[1]Sort Sheet'!W99)","v":0},{"$f":"IF('[1]Sort Sheet'!E99=0,\"\",'[1]Sort Sheet'!X99)","v":5.5},{"$f":"IF('[1]Sort Sheet'!E99=0,\"\",'[1]Sort Sheet'!M99)","v":"U"},{"$f":"IF('[1]Sort Sheet'!E99=0,\"\",'[1]Sort Sheet'!Z99)","v":62.5},{"$f":"IF('[1]Sort Sheet'!E99=0,\"\",'[1]Sort Sheet'!AA99)","v":10.200296735905045},{"$f":"IF('[1]Sort Sheet'!E99=0,\"\",'[1]Sort Sheet'!AB99)","v":1412.7410979228487},{"$f":"IF('[1]Sort Sheet'!E99=0,\"\",'[1]Sort Sheet'!AC99)","v":6.3751854599406528},141.27000000000001,1554.0110979228486,7.012685459940653]
[96,{"$f":"IF('[1]Sort Sheet'!D100=0,\"\",'[1]Sort Sheet'!D100)","v":239},{"$f":"IF('[1]Sort Sheet'!E100=0,\"\",'[1]Sort Sheet'!E100)","v":"332B"},{"$f":"IF('[1]Sort Sheet'!F100=0,\"\",'[1]Sort Sheet'!F100)","v":"M"},{"$f":"IF('[1]Sort Sheet'!E100=0,\"\",'[1]Sort Sheet'!AT100)","v":"Y"},{"$f":"IF('[1]Sort Sheet'!E100=0,\"\",'[1]Sort Sheet'!H100)","v":"N"},{"$f":"IF('[1]Sort Sheet'!E100=0,\"\",'[1]Sort Sheet'!J100)","v":"G E & E E Kroll"},{"$f":"IF('[1]Sort Sheet'!E100=0,\"\",'[1]Sort Sheet'!L100)","v":"Angus X"},{"$f":"IF('[1]Sort Sheet'!E100=0,\"\",'[1]Sort Sheet'!O100)","v":0},{"$f":"IF('[1]Sort Sheet'!P100=0,\"\",'[1]Sort Sheet'!P100)","v":243.2},{"$f":"IF('[1]Sort Sheet'!E100=0,\"\",'[1]Sort Sheet'!Q100)","v":8},{"$f":"IF('[1]Sort Sheet'!E100=0,\"\",'[1]Sort Sheet'!R100)","v":4},{"$f":"IF('[1]Sort Sheet'!E100=0,\"\",'[1]Sort Sheet'!S100)","v":80},{"$f":"IF('[1]Sort Sheet'!E100=0,\"\",'[1]Sort Sheet'!U100)","v":"5"},{"$f":"IF('[1]Sort Sheet'!E100=0,\"\",'[1]Sort Sheet'!V100)","v":2},{"$f":"IF('[1]Sort Sheet'!E100=0,\"\",'[1]Sort Sheet'!W100)","v":2},{"$f":"IF('[1]Sort Sheet'!E100=0,\"\",'[1]Sort Sheet'!X100)","v":5.99},{"$f":"IF('[1]Sort Sheet'!E100=0,\"\",'[1]Sort Sheet'!M100)","v":"U"},{"$f":"IF('[1]Sort Sheet'!E100=0,\"\",'[1]Sort Sheet'!Z100)","v":61.91},{"$f":"IF('[1]Sort Sheet'!E100=0,\"\",'[1]Sort Sheet'!AA100)","v":10.200296735905045},{"$f":"IF('[1]Sort Sheet'!E100=0,\"\",'[1]Sort Sheet'!AB100)","v":1535.8089020771513},{"$f":"IF('[1]Sort Sheet'!E100=0,\"\",'[1]Sort Sheet'!AC100)","v":6.3150037091988134},153.58000000000001,1689.3889020771512,6.9465004197251288]
[97,{"$f":"IF('[1]Sort Sheet'!D101=0,\"\",'[1]Sort Sheet'!D101)","v":235},{"$f":"IF('[1]Sort Sheet'!E101=0,\"\",'[1]Sort Sheet'!E101)","v":"332C"},{"$f":"IF('[1]Sort Sheet'!F101=0,\"\",'[1]Sort Sheet'!F101)","v":"F"},{"$f":"IF('[1]Sort Sheet'!E101=0,\"\",'[1]Sort Sheet'!AT101)","v":"N"},{"$f":"IF('[1]Sort Sheet'!E101=0,\"\",'[1]Sort Sheet'!H101)","v":"N"},{"$f":"IF('[1]Sort Sheet'!E101=0,\"\",'[1]Sort Sheet'!J101)","v":"G E & E E Kroll"},{"$f":"IF('[1]Sort Sheet'!E101=0,\"\",'[1]Sort Sheet'!L101)","v":"Braford X"},{"$f":"IF('[1]Sort Sheet'!E101=0,\"\",'[1]Sort Sheet'!O101)","v":2},{"$f":"IF('[1]Sort Sheet'!P101=0,\"\",'[1]Sort Sheet'!P101)","v":253.6},{"$f":"IF('[1]Sort Sheet'!E101=0,\"\",'[1]Sort Sheet'!Q101)","v":11},{"$f":"IF('[1]Sort Sheet'!E101=0,\"\",'[1]Sort Sheet'!R101)","v":3},{"$f":"IF('[1]Sort Sheet'!E101=0,\"\",'[1]Sort Sheet'!S101)","v":90},{"$f":"IF('[1]Sort Sheet'!E101=0,\"\",'[1]Sort Sheet'!U101)","v":"1b"},{"$f":"IF('[1]Sort Sheet'!E101=0,\"\",'[1]Sort Sheet'!V101)","v":2},{"$f":"IF('[1]Sort Sheet'!E101=0,\"\",'[1]Sort Sheet'!W101)","v":0},{"$f":"IF('[1]Sort Sheet'!E101=0,\"\",'[1]Sort Sheet'!X101)","v":5.5},{"$f":"IF('[1]Sort Sheet'!E101=0,\"\",'[1]Sort Sheet'!M101)","v":51.46},{"$f":"IF('[1]Sort Sheet'!E101=0,\"\",'[1]Sort Sheet'!Z101)","v":60.78},{"$f":"IF('[1]Sort Sheet'!E101=0,\"\",'[1]Sort Sheet'!AA101)","v":10.200296735905045},{"$f":"IF('[1]Sort Sheet'!E101=0,\"\",'[1]Sort Sheet'!AB101)","v":1572.2541543026705},{"$f":"IF('[1]Sort Sheet'!E101=0,\"\",'[1]Sort Sheet'!AC101)","v":6.1997403560830859},157.22999999999999,1729.4841543026705,6.8197324696477546]
[98,{"$f":"IF('[1]Sort Sheet'!D102=0,\"\",'[1]Sort Sheet'!D102)","v":257},{"$f":"IF('[1]Sort Sheet'!E102=0,\"\",'[1]Sort Sheet'!E102)","v":"339C"},{"$f":"IF('[1]Sort Sheet'!F102=0,\"\",'[1]Sort Sheet'!F102)","v":"F"},{"$f":"IF('[1]Sort Sheet'!E102=0,\"\",'[1]Sort Sheet'!AT102)","v":"N"},{"$f":"IF('[1]Sort Sheet'!E102=0,\"\",'[1]Sort Sheet'!H102)","v":"N"},{"$f":"IF('[1]Sort Sheet'!E102=0,\"\",'[1]Sort Sheet'!J102)","v":"RB & VA Budd & Willoise Grazing Co Pty Ltd"},{"$f":"IF('[1]Sort Sheet'!E102=0,\"\",'[1]Sort Sheet'!L102)","v":"Charolais X"},{"$f":"IF('[1]Sort Sheet'!E102=0,\"\",'[1]Sort Sheet'!O102)","v":0},{"$f":"IF('[1]Sort Sheet'!P102=0,\"\",'[1]Sort Sheet'!P102)","v":238.6},{"$f":"IF('[1]Sort Sheet'!E102=0,\"\",'[1]Sort Sheet'!Q102)","v":6},{"$f":"IF('[1]Sort Sheet'!E102=0,\"\",'[1]Sort Sheet'!R102)","v":3},{"$f":"IF('[1]Sort Sheet'!E102=0,\"\",'[1]Sort Sheet'!S102)","v":85},{"$f":"IF('[1]Sort Sheet'!E102=0,\"\",'[1]Sort Sheet'!U102)","v":"1b"},{"$f":"IF('[1]Sort Sheet'!E102=0,\"\",'[1]Sort Sheet'!V102)","v":1},{"$f":"IF('[1]Sort Sheet'!E102=0,\"\",'[1]Sort Sheet'!W102)","v":1},{"$f":"IF('[1]Sort Sheet'!E102=0,\"\",'[1]Sort Sheet'!X102)","v":5.49},{"$f":"IF('[1]Sort Sheet'!E102=0,\"\",'[1]Sort Sheet'!M102)","v":53.87},{"$f":"IF('[1]Sort Sheet'!E102=0,\"\",'[1]Sort Sheet'!Z102)","v":60.75},{"$f":"IF('[1]Sort Sheet'!E102=0,\"\",'[1]Sort Sheet'!AA102)","v":10.200296735905045},{"$f":"IF('[1]Sort Sheet'!E102=0,\"\",'[1]Sort Sheet'!AB102)","v":1478.5279117210684},{"$f":"IF('[1]Sort Sheet'!E102=0,\"\",'[1]Sort Sheet'!AC102)","v":6.1966802670623151},147.85,1626.3779117210684,6.8163365956457183]
[99,{"$f":"IF('[1]Sort Sheet'!D103=0,\"\",'[1]Sort Sheet'!D103)","v":258},{"$f":"IF('[1]Sort Sheet'!E103=0,\"\",'[1]Sort Sheet'!E103)","v":"339B"},{"$f":"IF('[1]Sort Sheet'!F103=0,\"\",'[1]Sort Sheet'!F103)","v":"F"},{"$f":"IF('[1]Sort Sheet'!E103=0,\"\",'[1]Sort Sheet'!AT103)","v":"N"},{"$f":"IF('[1]Sort Sheet'!E103=0,\"\",'[1]Sort Sheet'!H103)","v":"N"},{"$f":"IF('[1]Sort Sheet'!E103=0,\"\",'[1]Sort Sheet'!J103)","v":"RB & VA Budd & Willoise Grazing Co Pty Ltd"},{"$f":"IF('[1]Sort Sheet'!E103=0,\"\",'[1]Sort Sheet'!L103)","v":"Charolais X"},{"$f":"IF('[1]Sort Sheet'!E103=0,\"\",'[1]Sort Sheet'!O103)","v":0},{"$f":"IF('[1]Sort Sheet'!P103=0,\"\",'[1]Sort Sheet'!P103)","v":236.8},{"$f":"IF('[1]Sort Sheet'!E103=0,\"\",'[1]Sort Sheet'!Q103)","v":6},{"$f":"IF('[1]Sort Sheet'!E103=0,\"\",'[1]Sort Sheet'!R103)","v":3},{"$f":"IF('[1]Sort Sheet'!E103=0,\"\",'[1]Sort Sheet'!S103)","v":84},{"$f":"IF('[1]Sort Sheet'!E103=0,\"\",'[1]Sort Sheet'!U103)","v":"2"},{"$f":"IF('[1]Sort Sheet'!E103=0,\"\",'[1]Sort Sheet'!V103)","v":1},{"$f":"IF('[1]Sort Sheet'!E103=0,\"\",'[1]Sort Sheet'!W103)","v":0},{"$f":"IF('[1]Sort Sheet'!E103=0,\"\",'[1]Sort Sheet'!X103)","v":5.59},{"$f":"IF('[1]Sort Sheet'!E103=0,\"\",'[1]Sort Sheet'!M103)","v":51.51},{"$f":"IF('[1]Sort Sheet'!E103=0,\"\",'[1]Sort Sheet'!Z103)","v":60.68},{"$f":"IF('[1]Sort Sheet'!E103=0,\"\",'[1]Sort Sheet'!AA103)","v":10.200296735905045},{"$f":"IF('[1]Sort Sheet'!E103=0,\"\",'[1]Sort Sheet'!AB103)","v":1465.6830860534128},{"$f":"IF('[1]Sort Sheet'!E103=0,\"\",'[1]Sort Sheet'!AC103)","v":6.1895400593471823},146.57,1612.2530860534127,6.8085012079958309]
[100,{"$f":"IF('[1]Sort Sheet'!D104=0,\"\",'[1]Sort Sheet'!D104)","v":219},{"$f":"IF('[1]Sort Sheet'!E104=0,\"\",'[1]Sort Sheet'!E104)","v":"326B"},{"$f":"IF('[1]Sort Sheet'!F104=0,\"\",'[1]Sort Sheet'!F104)","v":"F"},{"$f":"IF('[1]Sort Sheet'!E104=0,\"\",'[1]Sort Sheet'!AT104)","v":"Y"},{"$f":"IF('[1]Sort Sheet'!E104=0,\"\",'[1]Sort Sheet'!H104)","v":"N"},{"$f":"IF('[1]Sort Sheet'!E104=0,\"\",'[1]Sort Sheet'!J104)","v":"R S & K M  Stevens Family Trust "},{"$f":"IF('[1]Sort Sheet'!E104=0,\"\",'[1]Sort Sheet'!L104)","v":"Charolais X Santa"},{"$f":"IF('[1]Sort Sheet'!E104=0,\"\",'[1]Sort Sheet'!O104)","v":0},{"$f":"IF('[1]Sort Sheet'!P104=0,\"\",'[1]Sort Sheet'!P104)","v":214.6},{"$f":"IF('[1]Sort Sheet'!E104=0,\"\",'[1]Sort Sheet'!Q104)","v":8},{"$f":"IF('[1]Sort Sheet'!E104=0,\"\",'[1]Sort Sheet'!R104)","v":4},{"$f":"IF('[1]Sort Sheet'!E104=0,\"\",'[1]Sort Sheet'!S104)","v":80},{"$f":"IF('[1]Sort Sheet'!E104=0,\"\",'[1]Sort Sheet'!U104)","v":"2"},{"$f":"IF('[1]Sort Sheet'!E104=0,\"\",'[1]Sort Sheet'!V104)","v":0},{"$f":"IF('[1]Sort Sheet'!E104=0,\"\",'[1]Sort Sheet'!W104)","v":1},{"$f":"IF('[1]Sort Sheet'!E104=0,\"\",'[1]Sort Sheet'!X104)","v":5.57},{"$f":"IF('[1]Sort Sheet'!E104=0,\"\",'[1]Sort Sheet'!M104)","v":55.82},{"$f":"IF('[1]Sort Sheet'!E104=0,\"\",'[1]Sort Sheet'!Z104)","v":60.58},{"$f":"IF('[1]Sort Sheet'!E104=0,\"\",'[1]Sort Sheet'!AA104)","v":10.200296735905045},{"$f":"IF('[1]Sort Sheet'!E104=0,\"\",'[1]Sort Sheet'!AB104)","v":1326.0863130563798},{"$f":"IF('[1]Sort Sheet'!E104=0,\"\",'[1]Sort Sheet'!AC104)","v":6.179339762611276},132.61000000000001,1458.6963130563799,6.7972801167585271]
[101,{"$f":"IF('[1]Sort Sheet'!D105=0,\"\",'[1]Sort Sheet'!D105)","v":248},{"$f":"IF('[1]Sort Sheet'!E105=0,\"\",'[1]Sort Sheet'!E105)","v":"333C"},{"$f":"IF('[1]Sort Sheet'!F105=0,\"\",'[1]Sort Sheet'!F105)","v":"F"},{"$f":"IF('[1]Sort Sheet'!E105=0,\"\",'[1]Sort Sheet'!AT105)","v":"N"},{"$f":"IF('[1]Sort Sheet'!E105=0,\"\",'[1]Sort Sheet'!H105)","v":"N"},{"$f":"IF('[1]Sort Sheet'!E105=0,\"\",'[1]Sort Sheet'!J105)","v":"John & Estelle  Drynan"},{"$f":"IF('[1]Sort Sheet'!E105=0,\"\",'[1]Sort Sheet'!L105)","v":"Charolais "},{"$f":"IF('[1]Sort Sheet'!E105=0,\"\",'[1]Sort Sheet'!O105)","v":0},{"$f":"IF('[1]Sort Sheet'!P105=0,\"\",'[1]Sort Sheet'!P105)","v":269.39999999999998},{"$f":"IF('[1]Sort Sheet'!E105=0,\"\",'[1]Sort Sheet'!Q105)","v":10},{"$f":"IF('[1]Sort Sheet'!E105=0,\"\",'[1]Sort Sheet'!R105)","v":4},{"$f":"IF('[1]Sort Sheet'!E105=0,\"\",'[1]Sort Sheet'!S105)","v":92},{"$f":"IF('[1]Sort Sheet'!E105=0,\"\",'[1]Sort Sheet'!U105)","v":"1b"},{"$f":"IF('[1]Sort Sheet'!E105=0,\"\",'[1]Sort Sheet'!V105)","v":1},{"$f":"IF('[1]Sort Sheet'!E105=0,\"\",'[1]Sort Sheet'!W105)","v":1},{"$f":"IF('[1]Sort Sheet'!E105=0,\"\",'[1]Sort Sheet'!X105)","v":5.44},{"$f":"IF('[1]Sort Sheet'!E105=0,\"\",'[1]Sort Sheet'!M105)","v":61.4},{"$f":"IF('[1]Sort Sheet'!E105=0,\"\",'[1]Sort Sheet'!Z105)","v":59.97},{"$f":"IF('[1]Sort Sheet'!E105=0,\"\",'[1]Sort Sheet'!AA105)","v":10.200296735905045},{"$f":"IF('[1]Sort Sheet'!E105=0,\"\",'[1]Sort Sheet'!AB105)","v":1647.9515764094954},{"$f":"IF('[1]Sort Sheet'!E105=0,\"\",'[1]Sort Sheet'!AC105)","v":6.1171179525222552},164.8,1812.7515764094953,6.7288477223812011]
[102,{"$f":"IF('[1]Sort Sheet'!D106=0,\"\",'[1]Sort Sheet'!D106)","v":261},{"$f":"IF('[1]Sort Sheet'!E106=0,\"\",'[1]Sort Sheet'!E106)","v":"337A"},{"$f":"IF('[1]Sort Sheet'!F106=0,\"\",'[1]Sort Sheet'!F106)","v":"F"},{"$f":"IF('[1]Sort Sheet'!E106=0,\"\",'[1]Sort Sheet'!AT106)","v":"Y"},{"$f":"IF('[1]Sort Sheet'!E106=0,\"\",'[1]Sort Sheet'!H106)","v":"N"},{"$f":"IF('[1]Sort Sheet'!E106=0,\"\",'[1]Sort Sheet'!J106)","v":"RB & VA Budd & Willoise Grazing Co Pty Ltd"},{"$f":"IF('[1]Sort Sheet'!E106=0,\"\",'[1]Sort Sheet'!L106)","v":"Charolais X"},{"$f":"IF('[1]Sort Sheet'!E106=0,\"\",'[1]Sort Sheet'!O106)","v":0},{"$f":"IF('[1]Sort Sheet'!P106=0,\"\",'[1]Sort Sheet'!P106)","v":211.6},{"$f":"IF('[1]Sort Sheet'!E106=0,\"\",'[1]Sort Sheet'!Q106)","v":10},{"$f":"IF('[1]Sort Sheet'!E106=0,\"\",'[1]Sort Sheet'!R106)","v":3},{"$f":"IF('[1]Sort Sheet'!E106=0,\"\",'[1]Sort Sheet'!S106)","v":70},{"$f":"IF('[1]Sort Sheet'!E106=0,\"\",'[1]Sort Sheet'!U106)","v":"2"},{"$f":"IF('[1]Sort Sheet'!E106=0,\"\",'[1]Sort Sheet'!V106)","v":2},{"$f":"IF('[1]Sort Sheet'!E106=0,\"\",'[1]Sort Sheet'!W106)","v":1},{"$f":"IF('[1]Sort Sheet'!E106=0,\"\",'[1]Sort Sheet'!X106)","v":5.56},{"$f":"IF('[1]Sort Sheet'!E106=0,\"\",'[1]Sort Sheet'!M106)","v":54.31},{"$f":"IF('[1]Sort Sheet'!E106=0,\"\",'[1]Sort Sheet'!Z106)","v":59.67},{"$f":"IF('[1]Sort Sheet'!E106=0,\"\",'[1]Sort Sheet'!AA106)","v":10.200296735905045},{"$f":"IF('[1]Sort Sheet'!E106=0,\"\",'[1]Sort Sheet'!AB106)","v":1287.9070103857568},{"$f":"IF('[1]Sort Sheet'!E106=0,\"\",'[1]Sort Sheet'!AC106)","v":6.0865170623145408},{"$f":"IF(U110=\"\",\"\",ROUND(U110*0.1,2))","v":128.79},{"$f":"IF(W110=\"\",\"\",U110+W110)","v":1416.6970103857568},{"$f":"X110/J110","v":6.6951654555092475}]
[103,{"$f":"IF('[1]Sort Sheet'!D107=0,\"\",'[1]Sort Sheet'!D107)","v":253},{"$f":"IF('[1]Sort Sheet'!E107=0,\"\",'[1]Sort Sheet'!E107)","v":"337B"},{"$f":"IF('[1]Sort Sheet'!F107=0,\"\",'[1]Sort Sheet'!F107)","v":"F"},{"$f":"IF('[1]Sort Sheet'!E107=0,\"\",'[1]Sort Sheet'!AT107)","v":"Y"},{"$f":"IF('[1]Sort Sheet'!E107=0,\"\",'[1]Sort Sheet'!H107)","v":"N"},{"$f":"IF('[1]Sort Sheet'!E107=0,\"\",'[1]Sort Sheet'!J107)","v":"RB & VA Budd & Willoise Grazing Co Pty Ltd"},{"$f":"IF('[1]Sort Sheet'!E107=0,\"\",'[1]Sort Sheet'!L107)","v":"Charolais X"},{"$f":"IF('[1]Sort Sheet'!E107=0,\"\",'[1]Sort Sheet'!O107)","v":0},{"$f":"IF('[1]Sort Sheet'!P107=0,\"\",'[1]Sort Sheet'!P107)","v":210.4},{"$f":"IF('[1]Sort Sheet'!E107=0,\"\",'[1]Sort Sheet'!Q107)","v":8},{"$f":"IF('[1]Sort Sheet'!E107=0,\"\",'[1]Sort Sheet'!R107)","v":5},{"$f":"IF('[1]Sort Sheet'!E107=0,\"\",'[1]Sort Sheet'!S107)","v":76},{"$f":"IF('[1]Sort Sheet'!E107=0,\"\",'[1]Sort Sheet'!U107)","v":"1b"},{"$f":"IF('[1]Sort Sheet'!E107=0,\"\",'[1]Sort Sheet'!V107)","v":0},{"$f":"IF('[1]Sort Sheet'!E107=0,\"\",'[1]Sort Sheet'!W107)","v":0},{"$f":"IF('[1]Sort Sheet'!E107=0,\"\",'[1]Sort Sheet'!X107)","v":5.43},{"$f":"IF('[1]Sort Sheet'!E107=0,\"\",'[1]Sort Sheet'!M107)","v":55.05},{"$f":"IF('[1]Sort Sheet'!E107=0,\"\",'[1]Sort Sheet'!Z107)","v":59.65},{"$f":"IF('[1]Sort Sheet'!E107=0,\"\",'[1]Sort Sheet'!AA107)","v":10.200296735905045},{"$f":"IF('[1]Sort Sheet'!E107=0,\"\",'[1]Sort Sheet'!AB107)","v":1280.1739614243324},{"$f":"IF('[1]Sort Sheet'!E107=0,\"\",'[1]Sort Sheet'!AC107)","v":6.0844770029673594},{"$f":"IF(U111=\"\",\"\",ROUND(U111*0.1,2))","v":128.02000000000001},{"$f":"IF(W111=\"\",\"\",U111+W111)","v":1408.1939614243324},{"$f":"X111/J111","v":6.692937079012987}]
[104,{"$f":"IF('[1]Sort Sheet'!D108=0,\"\",'[1]Sort Sheet'!D108)","v":251},{"$f":"IF('[1]Sort Sheet'!E108=0,\"\",'[1]Sort Sheet'!E108)","v":"336C"},{"$f":"IF('[1]Sort Sheet'!F108=0,\"\",'[1]Sort Sheet'!F108)","v":"F"},{"$f":"IF('[1]Sort Sheet'!E108=0,\"\",'[1]Sort Sheet'!AT108)","v":"N"},{"$f":"IF('[1]Sort Sheet'!E108=0,\"\",'[1]Sort Sheet'!H108)","v":"N"},{"$f":"IF('[1]Sort Sheet'!E108=0,\"\",'[1]Sort Sheet'!J108)","v":"Ben & Megan Drynan "},{"$f":"IF('[1]Sort Sheet'!E108=0,\"\",'[1]Sort Sheet'!L108)","v":"Charolais "},{"$f":"IF('[1]Sort Sheet'!E108=0,\"\",'[1]Sort Sheet'!O108)","v":0},{"$f":"IF('[1]Sort Sheet'!P108=0,\"\",'[1]Sort Sheet'!P108)","v":263.39999999999998},{"$f":"IF('[1]Sort Sheet'!E108=0,\"\",'[1]Sort Sheet'!Q108)","v":6},{"$f":"IF('[1]Sort Sheet'!E108=0,\"\",'[1]Sort Sheet'!R108)","v":3},{"$f":"IF('[1]Sort Sheet'!E108=0,\"\",'[1]Sort Sheet'!S108)","v":84},{"$f":"IF('[1]Sort Sheet'!E108=0,\"\",'[1]Sort Sheet'!U108)","v":"2"},{"$f":"IF('[1]Sort Sheet'!E108=0,\"\",'[1]Sort Sheet'!V108)","v":1},{"$f":"IF('[1]Sort Sheet'!E108=0,\"\",'[1]Sort Sheet'!W108)","v":1},{"$f":"IF('[1]Sort Sheet'!E108=0,\"\",'[1]Sort Sheet'!X108)","v":5.44},{"$f":"IF('[1]Sort Sheet'!E108=0,\"\",'[1]Sort Sheet'!M108)","v":60.76},{"$f":"IF('[1]Sort Sheet'!E108=0,\"\",'[1]Sort Sheet'!Z108)","v":59.44},{"$f":"IF('[1]Sort Sheet'!E108=0,\"\",'[1]Sort Sheet'!AA108)","v":10.200296735905045},{"$f":"IF('[1]Sort Sheet'!E108=0,\"\",'[1]Sort Sheet'!AB108)","v":1597.0090504451039},{"$f":"IF('[1]Sort Sheet'!E108=0,\"\",'[1]Sort Sheet'!AC108)","v":6.0630563798219592},159.69999999999999,1756.7090504451039,6.6693585817961427]
[105,{"$f":"IF('[1]Sort Sheet'!D109=0,\"\",'[1]Sort Sheet'!D109)","v":250},{"$f":"IF('[1]Sort Sheet'!E109=0,\"\",'[1]Sort Sheet'!E109)","v":"336A"},{"$f":"IF('[1]Sort Sheet'!F109=0,\"\",'[1]Sort Sheet'!F109)","v":"F"},{"$f":"IF('[1]Sort Sheet'!E109=0,\"\",'[1]Sort Sheet'!AT109)","v":"N"},{"$f":"IF('[1]Sort Sheet'!E109=0,\"\",'[1]Sort Sheet'!H109)","v":"N"},{"$f":"IF('[1]Sort Sheet'!E109=0,\"\",'[1]Sort Sheet'!J109)","v":"Ben & Megan Drynan "},{"$f":"IF('[1]Sort Sheet'!E109=0,\"\",'[1]Sort Sheet'!L109)","v":"Charolais "},{"$f":"IF('[1]Sort Sheet'!E109=0,\"\",'[1]Sort Sheet'!O109)","v":0},{"$f":"IF('[1]Sort Sheet'!P109=0,\"\",'[1]Sort Sheet'!P109)","v":280.2},{"$f":"IF('[1]Sort Sheet'!E109=0,\"\",'[1]Sort Sheet'!Q109)","v":6},{"$f":"IF('[1]Sort Sheet'!E109=0,\"\",'[1]Sort Sheet'!R109)","v":5},{"$f":"IF('[1]Sort Sheet'!E109=0,\"\",'[1]Sort Sheet'!S109)","v":90},{"$f":"IF('[1]Sort Sheet'!E109=0,\"\",'[1]Sort Sheet'!U109)","v":"1b"},{"$f":"IF('[1]Sort Sheet'!E109=0,\"\",'[1]Sort Sheet'!V109)","v":1},{"$f":"IF('[1]Sort Sheet'!E109=0,\"\",'[1]Sort Sheet'!W109)","v":1},{"$f":"IF('[1]Sort Sheet'!E109=0,\"\",'[1]Sort Sheet'!X109)","v":5.4},{"$f":"IF('[1]Sort Sheet'!E109=0,\"\",'[1]Sort Sheet'!M109)","v":62.17},{"$f":"IF('[1]Sort Sheet'!E109=0,\"\",'[1]Sort Sheet'!Z109)","v":58.79},{"$f":"IF('[1]Sort Sheet'!E109=0,\"\",'[1]Sort Sheet'!AA109)","v":10.200296735905045},{"$f":"IF('[1]Sort Sheet'!E109=0,\"\",'[1]Sort Sheet'!AB109)","v":1680.2905971810087},{"$f":"IF('[1]Sort Sheet'!E109=0,\"\",'[1]Sort Sheet'!AC109)","v":5.9967544510385755},168.03,1848.3205971810087,6.5964332518951059]
[106,{"$f":"IF('[1]Sort Sheet'!D110=0,\"\",'[1]Sort Sheet'!D110)","v":223},{"$f":"IF('[1]Sort Sheet'!E110=0,\"\",'[1]Sort Sheet'!E110)","v":"325A"},{"$f":"IF('[1]Sort Sheet'!F110=0,\"\",'[1]Sort Sheet'!F110)","v":"F"},{"$f":"IF('[1]Sort Sheet'!E110=0,\"\",'[1]Sort Sheet'!AT110)","v":"N"},{"$f":"IF('[1]Sort Sheet'!E110=0,\"\",'[1]Sort Sheet'!H110)","v":"N"},{"$f":"IF('[1]Sort Sheet'!E110=0,\"\",'[1]Sort Sheet'!J110)","v":"R S & K M  Stevens Family Trust "},{"$f":"IF('[1]Sort Sheet'!E110=0,\"\",'[1]Sort Sheet'!L110)","v":"Charolais X Brangus"},{"$f":"IF('[1]Sort Sheet'!E110=0,\"\",'[1]Sort Sheet'!O110)","v":0},{"$f":"IF('[1]Sort Sheet'!P110=0,\"\",'[1]Sort Sheet'!P110)","v":244.6},{"$f":"IF('[1]Sort Sheet'!E110=0,\"\",'[1]Sort Sheet'!Q110)","v":8},{"$f":"IF('[1]Sort Sheet'!E110=0,\"\",'[1]Sort Sheet'!R110)","v":6},{"$f":"IF('[1]Sort Sheet'!E110=0,\"\",'[1]Sort Sheet'!S110)","v":83},{"$f":"IF('[1]Sort Sheet'!E110=0,\"\",'[1]Sort Sheet'!U110)","v":"2"},{"$f":"IF('[1]Sort Sheet'!E110=0,\"\",'[1]Sort Sheet'!V110)","v":1},{"$f":"IF('[1]Sort Sheet'!E110=0,\"\",'[1]Sort Sheet'!W110)","v":1},{"$f":"IF('[1]Sort Sheet'!E110=0,\"\",'[1]Sort Sheet'!X110)","v":5.47},{"$f":"IF('[1]Sort Sheet'!E110=0,\"\",'[1]Sort Sheet'!M110)","v":55.51},{"$f":"IF('[1]Sort Sheet'!E110=0,\"\",'[1]Sort Sheet'!Z110)","v":58.66},{"$f":"IF('[1]Sort Sheet'!E110=0,\"\",'[1]Sort Sheet'!AA110)","v":10.200296735905045},{"$f":"IF('[1]Sort Sheet'!E110=0,\"\",'[1]Sort Sheet'!AB110)","v":1463.5626483679525},{"$f":"IF('[1]Sort Sheet'!E110=0,\"\",'[1]Sort Sheet'!AC110)","v":5.9834940652818993},146.36000000000001,1609.9226483679527,6.5818587423056121]
[107,{"$f":"IF('[1]Sort Sheet'!D111=0,\"\",'[1]Sort Sheet'!D111)","v":194},{"$f":"IF('[1]Sort Sheet'!E111=0,\"\",'[1]Sort Sheet'!E111)","v":"317C"},{"$f":"IF('[1]Sort Sheet'!F111=0,\"\",'[1]Sort Sheet'!F111)","v":"F"},{"$f":"IF('[1]Sort Sheet'!E111=0,\"\",'[1]Sort Sheet'!AT111)","v":"N"},{"$f":"IF('[1]Sort Sheet'!E111=0,\"\",'[1]Sort Sheet'!H111)","v":"N"},{"$f":"IF('[1]Sort Sheet'!E111=0,\"\",'[1]Sort Sheet'!J111)","v":"Riverglen Pastoral Company"},{"$f":"IF('[1]Sort Sheet'!E111=0,\"\",'[1]Sort Sheet'!L111)","v":"Charolais X"},{"$f":"IF('[1]Sort Sheet'!E111=0,\"\",'[1]Sort Sheet'!O111)","v":0},{"$f":"IF('[1]Sort Sheet'!P111=0,\"\",'[1]Sort Sheet'!P111)","v":274.2},{"$f":"IF('[1]Sort Sheet'!E111=0,\"\",'[1]Sort Sheet'!Q111)","v":10},{"$f":"IF('[1]Sort Sheet'!E111=0,\"\",'[1]Sort Sheet'!R111)","v":4},{"$f":"IF('[1]Sort Sheet'!E111=0,\"\",'[1]Sort Sheet'!S111)","v":83},{"$f":"IF('[1]Sort Sheet'!E111=0,\"\",'[1]Sort Sheet'!U111)","v":"3"},{"$f":"IF('[1]Sort Sheet'!E111=0,\"\",'[1]Sort Sheet'!V111)","v":1},{"$f":"IF('[1]Sort Sheet'!E111=0,\"\",'[1]Sort Sheet'!W111)","v":1},{"$f":"IF('[1]Sort Sheet'!E111=0,\"\",'[1]Sort Sheet'!X111)","v":5.66},{"$f":"IF('[1]Sort Sheet'!E111=0,\"\",'[1]Sort Sheet'!M111)","v":59.77},{"$f":"IF('[1]Sort Sheet'!E111=0,\"\",'[1]Sort Sheet'!Z111)","v":58.28},{"$f":"IF('[1]Sort Sheet'!E111=0,\"\",'[1]Sort Sheet'!AA111)","v":10.200296735905045},{"$f":"IF('[1]Sort Sheet'!E111=0,\"\",'[1]Sort Sheet'!AB111)","v":1630.0457715133532},{"$f":"IF('[1]Sort Sheet'!E111=0,\"\",'[1]Sort Sheet'!AC111)","v":5.9447329376854601},163,1793.0457715133532,6.539189538706613]
[108,{"$f":"IF('[1]Sort Sheet'!D112=0,\"\",'[1]Sort Sheet'!D112)","v":278},{"$f":"IF('[1]Sort Sheet'!E112=0,\"\",'[1]Sort Sheet'!E112)","v":"345C"},{"$f":"IF('[1]Sort Sheet'!F112=0,\"\",'[1]Sort Sheet'!F112)","v":"F"},{"$f":"IF('[1]Sort Sheet'!E112=0,\"\",'[1]Sort Sheet'!AT112)","v":"Y"},{"$f":"IF('[1]Sort Sheet'!E112=0,\"\",'[1]Sort Sheet'!H112)","v":"N"},{"$f":"IF('[1]Sort Sheet'!E112=0,\"\",'[1]Sort Sheet'!J112)","v":"Arubial Pty Ltd"},{"$f":"IF('[1]Sort Sheet'!E112=0,\"\",'[1]Sort Sheet'!L112)","v":"Santa X"},{"$f":"IF('[1]Sort Sheet'!E112=0,\"\",'[1]Sort Sheet'!O112)","v":0},{"$f":"IF('[1]Sort Sheet'!P112=0,\"\",'[1]Sort Sheet'!P112)","v":278.60000000000002},{"$f":"IF('[1]Sort Sheet'!E112=0,\"\",'[1]Sort Sheet'!Q112)","v":15},{"$f":"IF('[1]Sort Sheet'!E112=0,\"\",'[1]Sort Sheet'!R112)","v":5},{"$f":"IF('[1]Sort Sheet'!E112=0,\"\",'[1]Sort Sheet'!S112)","v":84},{"$f":"IF('[1]Sort Sheet'!E112=0,\"\",'[1]Sort Sheet'!U112)","v":"5"},{"$f":"IF('[1]Sort Sheet'!E112=0,\"\",'[1]Sort Sheet'!V112)","v":1},{"$f":"IF('[1]Sort Sheet'!E112=0,\"\",'[1]Sort Sheet'!W112)","v":1},{"$f":"IF('[1]Sort Sheet'!E112=0,\"\",'[1]Sort Sheet'!X112)","v":5.88},{"$f":"IF('[1]Sort Sheet'!E112=0,\"\",'[1]Sort Sheet'!M112)","v":"U"},{"$f":"IF('[1]Sort Sheet'!E112=0,\"\",'[1]Sort Sheet'!Z112)","v":57.73},{"$f":"IF('[1]Sort Sheet'!E112=0,\"\",'[1]Sort Sheet'!AA112)","v":10.200296735905045},{"$f":"IF('[1]Sort Sheet'!E112=0,\"\",'[1]Sort Sheet'!AB112)","v":1640.5726817507423},{"$f":"IF('[1]Sort Sheet'!E112=0,\"\",'[1]Sort Sheet'!AC112)","v":5.8886313056379835},164.06,1804.6326817507422,6.4775042417471003]

{"sheet":"Champ Carcases","index":1,"n_rows":35,"n_cols":18,"rows_kept":35,"cut":false,"hidden":false,"merged":[[14,2,14,5],[18,1,18,4],[27,2,27,6],[31,1,31,4]]}
[]
[]
[]
[]
[]
[]
[]
[]
[]
[]
[]
[]
[]
[]
["Competitor :   ",null,"Darr Creek Pastoral"]
[]
["Ear Tag :",null,"321B"]
[]
["Breed : ","Angus X Limousin"]
[]
["Body No.","Ear Tag Number","Sex","Fat Dist.","Dent","P8 Fat Depth","Rib Fat Depth","EMA","Meat Colour","Fat Colour","Marbling","pH","HSCW","Index Score","Lean Meat Yield %","Yield C/KG","Carcase Value GST Ex-clusive","PBP C/KG GST       Ex-clusive"]
[201,"321B","M","Y",0,6,3,94,"1b",0,0,5.46,272.8,54.37,63.35,10.756676557863502,1858.9559347181012,6.8143545994065287]
[]
[]
[]
[]
[]
["Competitor : ",null,"B Feeders Pty ltd"]
[]
["Ear Tag :",null,"349C"]
[]
["Breed :","Charolais X Santa"]
[]
["Body No.","Ear Tag Number","Sex","Fat Dist.","Dent","P8 Fat Depth","Rib Fat Depth","EMA","Meat Colour","Fat Colour","Marbling","pH","HSCW","Index Score","Lean Meat Yield %","Yield C/KG","Carcase Value GST Ex-clusive","PBP C/KG GST       Ex-clusive"]
[289,"349C","M","Y",0,6,3,102,"1b",1,1,5.49,304.39999999999998,51.87,63.17,10.756676557863502,2068.3957418397626,6.7949925816023748]

{"sheet":"Pen of 3 Results","index":2,"n_rows":50,"n_cols":17,"rows_kept":50,"cut":false,"hidden":false,"merged":[[35,0,35,2],[42,2,42,5],[49,0,49,2],[14,2,14,5],[21,0,21,2],[28,2,28,5]]}
[]
[]
[]
[]
[]
[]
[]
[]
[]
[]
[]
[]
[]
[]
["Competitor :",null,"Darr Creek Pastoral",null,null,null,null,"Lot NO :",301,null,null,"BREED : ","Angus X Limousin"]
[]
["Body No.","Ear Tag Number","Sex","Dent","P8 Fat Depth","Rib Fat Depth","EMA","Meat Colour","Fat Colour","Marbling","pH","HSCW","Index Score","Lean Meat Yield %","Yield C/KG","PBP\nCarcase Value (Ex GST)","PBP\n$/kg                     (Ex GST)"]
[206,"321A","M",0,10,4,91,"2",1,1,5.58,292.39999999999998,56.22,61.5,0,0,0]
[201,"321B","M",0,6,3,94,"1b",0,0,5.46,272.8,54.37,63.35,0,0,0]
[203,"321C","M",0,10,3,90,"2",1,1,5.64,269.8,54.48,62.79,0,0,0]
[]
["AVERAGES",null,null,null,9,3,92,null,1,1,5.56,278.3,55,62.54666666666666,0,0,0]
[]
[]
[]
[]
[]
[]
["Competitor :",null,"Rich Enterprises P/L",null,null,null,null,"Lot NO :",302,null,null,"BREED : ","Angus / Charolais X"]
[]
["Body No.","Ear Tag Number","Sex","Dent","P8 Fat Depth","Rib Fat Depth","EMA","Meat Colour","Fat Colour","Marbling","pH","HSCW","Index Score","Lean Meat Yield %","Yield C/KG","PBP\nCarcase\nValue (Ex GST)","PBP\n$/kg               (Ex GST)"]
[209,"322A","M",0,10,3,80,"1b",1,1,5.49,299.8,54.51,59.74,0,0,0]
[212,"322B","M",0,8,3,91,"1b",1,1,5.48,275,55.52,62.73,0,0,0]
[213,"322C","M",0,10,5,86,"3",2,1,5.68,279.8,56.23,60.92,0,0,0]
[]
["AVERAGES",null,null,null,9,4,86,null,1,1,5.55,284.89999999999998,55.4,61.129999999999995,0,0,0]
[]
[]
[]
[]
[]
[]
["Competitor :",null,"B Feeders Pty ltd",null,null,null,null,"Lot NO :",314,null,null,"BREED : ","Charolais X Santa"]
[]
["Body No.","Ear Tag Number","Sex","Dent","P8 Fat Depth","Rib Fat Depth","EMA","Meat Colour","Fat Colour","Marbling","pH","HSCW","Index Score","Lean Meat Yield %","Yield C/KG","PBP\nCarcase\nValue (Ex GST)","PBP\n$/kg               (Ex GST)"]
[291,"349A","M",0,10,3,80,"2",1,1,5.52,307.39999999999998,54.33,59.35,0,0,0]
[294,"349B","M",0,15,5,91,"1b",1,1,5.52,298.2,53.65,60.71,0,0,0]
[289,"349C","M",0,6,3,102,"1b",1,1,5.49,304.39999999999998,51.87,63.17,0,0,0]
[]
["AVERAGES",null,null,null,10,4,91,null,1,1,5.51,303.3,53.3,61.076666666666675,0,0,6.3319900000000002]